⚠ Raw data does not conform to the expected structure. Expected either a tuple of (mean, SEM) or a float, but got None.
Run-UUID: e878aee0-ab9e-49c4-ad3f-bb6e1e9ee6c4
____________________________________________
| OmniOpt2 - Hyperparameter alchemy in action! |
============================================
\
\
\
\
/ \\ //\\
|\\___/| / \\// \\\\
/0 0 \\__ / // | \\ \\
/ / \\/_/ // | \\ \\
\@_^_\@'/ \\/_ // | \\ \\
//_^_/ \\/_ // | \\ \\
( //) | \\/// | \\ \\
( / /) _|_ / ) // | \\ _\\
( // /) '/,_ _ _/ ( ; -. | _ _\\.-~ .-~~~^-.
(( / / )) ,-{ _ `-.|.-~-. .~ `.
(( // / )) '/\\ / ~-. _ .-~ .-~^-. \\
(( /// )) `. { } / \\ \\
(( / )) .----~-.\\ \\-' .~ \\ `. \\^-.
///.----..> \\ _ -~ `. ^-` ^-_
///-._ _ _ _ _ _ _}^ - - - - ~ ~-- ,.-~
/.-~
./omniopt --max_nr_of_zero_results 3 --live_share --send_anonymized_usage_stats --partition=alpha --gpus=0 --experiment_name=test_wronggoing_stuff --mem_gb=1 --time=120 --worker_timeout=1 --max_eval=23 --num_parallel_jobs=10 --run_program Li8udGVzdHMvdGVzdF93cm9uZ2dvaW5nX3N0dWZmLmJpbi9iaW4vJShwcm9ncmFtKQ== --parameter program choice divide_by_0,simple_ok,perl,exit_code_137,result_but_exit_code_stdout_stderr,exit_code_stdout,signal_but_has_output,exit_code_no_output,exit_code_stdout_stderr,module_not_found,signal,empty,file_does_not_exist,sleep_10_and_result_exit_252,no_chmod_x,no_shebang,perl_module_fail,segfault,wrong_arch,python_name_error,syntax_error,tensorflow_syntax_error,force_keyboard_interrupt --num_random_steps=1 --follow
Run-folder: /home/runner/work/OmniOpt/OmniOpt/runs/test_wronggoing_stuff/0See https://imageseg.scads.de/omniax/share?user_id=runner&experiment_name=test_wronggoing_stuff&run_nr=91 for live-results.
You have 4 CPUs available for the main process.No CUDA devices found.Generation strategy: SOBOL for 1 step and then BOTORCH_MODULAR for 22 steps.
Run-Program: ./.tests/test_wronggoing_stuff.bin/bin/%(program)
Experiment parameters
┏━━━━━━━━━┳━━━━━━━━┳━━━━━━━━━━━━━━━━━━━━━━━━━━━━━━━━━━━━━━━━━━━━━━━━━━━━━━━━━━━┓
┃Name ┃Type ┃Values ┃
┡━━━━━━━━━╇━━━━━━━━╇━━━━━━━━━━━━━━━━━━━━━━━━━━━━━━━━━━━━━━━━━━━━━━━━━━━━━━━━━━━┩
│program│choice│divide_by_0, simple_ok, perl, exit_code_137, │
│││result_but_exit_code_stdout_stderr, exit_code_stdout, │
│││signal_but_has_output, exit_code_no_output, │
│││exit_code_stdout_stderr, module_not_found, signal, empty,│
│││file_does_not_exist, sleep_10_and_result_exit_252, │
│││no_chmod_x, no_shebang, perl_module_fail, segfault, │
│││wrong_arch, python_name_error, syntax_error, │
│││tensorflow_syntax_error, force_keyboard_interrupt │
└─────────┴────────┴───────────────────────────────────────────────────────────┘
Result-Names
┏━━━━━━━━━━━━━┳━━━━━━━━━━━━━┓
┃Result-Name┃Min or max?┃
┡━━━━━━━━━━━━━╇━━━━━━━━━━━━━┩
│RESULT │ min│
└─────────────┴─────────────┘
╭────────────────OmniOpt evaluation failed - quick diagnosis─────────────────╮│││ Command: ││ ./.tests/test_wronggoing_stuff.bin/bin/sleep_10_and_result_exit_252 ││ Working dir: /home/runner/work/OmniOpt/OmniOpt ││ Exit code: 252 ││ Signal: signal 124 (124) ││ Parsed result: {'RESULT': 1234.0} ││ Likely cause(s) and how to fix: ││ - The process was terminated by signal 124 (124). ││ - Your program produced a valid result but still exited with code 252. ││ OmniOpt may count this evaluation as successful; fix the exit code if that ││ is not intended. ││ Relevant output (last lines): ││ RESULT: 1234 │││╰──────────────────────────────────────────────────────────────────────────────╯╭────────────────OmniOpt evaluation failed - quick diagnosis─────────────────╮│││ Command: ./.tests/test_wronggoing_stuff.bin/bin/wrong_arch ││ Working dir: /home/runner/work/OmniOpt/OmniOpt ││ Exit code: 126 ││ Parsed result: {'RESULT': None} ││ Likely cause(s) and how to fix: ││ - Your program produced no stdout. OmniOpt reads results from stdout, so ││ print something like 'RESULT: 1.23'. ││ - Missing numeric result(s) for: RESULT. ││ - Your program exited with code 126 (Command Invoked Cannot Execute - ││ Permission problem or command is not an executable or it was compiled for ││ a different platform). Check the stderr/traceback above. ││ Relevant output (last lines): ││ /bin/sh: 1: ./.tests/test_wronggoing_stuff.bin/bin/wrong_arch: Exec ││ format error │││╰──────────────────────────────────────────────────────────────────────────────╯
⚠ Raw data does not conform to the expected structure. Expected either a tuple of (mean, SEM) or a float, but got None.╭────────────────OmniOpt evaluation failed - quick diagnosis─────────────────╮│││ Command: ./.tests/test_wronggoing_stuff.bin/bin/python_name_error ││ Working dir: /home/runner/work/OmniOpt/OmniOpt ││ Exit code: 1 ││ Parsed result: {'RESULT': None} ││ Likely cause(s) and how to fix: ││ - Your program raised a Python exception: NameError: name 'askldasdasd' ││ is not defined. Fix the traceback shown above. ││ - Your program produced no stdout. OmniOpt reads results from stdout, so ││ print something like 'RESULT: 1.23'. ││ - Missing numeric result(s) for: RESULT. ││ Relevant output (last lines): ││ Traceback (most recent call last): ││ File ││ "/home/runner/work/OmniOpt/OmniOpt/./.tests/test_wronggoing_stuff.bin/bin/ ││ python_name_error", line 2, in ││ askldasdasd ││ NameError: name 'askldasdasd' is not defined │││╰──────────────────────────────────────────────────────────────────────────────╯
⚠ Raw data does not conform to the expected structure. Expected either a tuple of (mean, SEM) or a float, but got None.╭────────────────OmniOpt evaluation failed - quick diagnosis─────────────────╮│││ Command: ./.tests/test_wronggoing_stuff.bin/bin/no_chmod_x ││ Working dir: /home/runner/work/OmniOpt/OmniOpt ││ Exit code: 126 ││ Parsed result: {'RESULT': None} ││ Likely cause(s) and how to fix: ││ - A file or command was not executable. Run 'chmod +x ' or ││ invoke the script explicitly with 'bash ' / 'python3 '. ││ - Your program produced no stdout. OmniOpt reads results from stdout, so ││ print something like 'RESULT: 1.23'. ││ - Missing numeric result(s) for: RESULT. ││ Relevant output (last lines): ││ /bin/sh: 1: ./.tests/test_wronggoing_stuff.bin/bin/no_chmod_x: ││ Permission denied │││╰──────────────────────────────────────────────────────────────────────────────╯
⚠ Raw data does not conform to the expected structure. Expected either a tuple of (mean, SEM) or a float, but got None.╭────────────────OmniOpt evaluation failed - quick diagnosis─────────────────╮│││ Command: ./.tests/test_wronggoing_stuff.bin/bin/divide_by_0 ││ Working dir: /home/runner/work/OmniOpt/OmniOpt ││ Exit code: 255 ││ Signal: signal 127 (127) ││ Parsed result: {'RESULT': None} ││ Likely cause(s) and how to fix: ││ - The process was terminated by signal 127 (127). ││ - Your program produced no stdout. OmniOpt reads results from stdout, so ││ print something like 'RESULT: 1.23'. ││ - Missing numeric result(s) for: RESULT. ││ Relevant output (last lines): ││ Illegal division by zero at ││ ./.tests/test_wronggoing_stuff.bin/bin/divide_by_0 line 3. │││╰──────────────────────────────────────────────────────────────────────────────╯
⚠ Raw data does not conform to the expected structure. Expected either a tuple of (mean, SEM) or a float, but got None.╭────────────────OmniOpt evaluation failed - quick diagnosis─────────────────╮│││ Command: ││ ./.tests/test_wronggoing_stuff.bin/bin/exit_code_stdout_stderr ││ Working dir: /home/runner/work/OmniOpt/OmniOpt ││ Exit code: 5 ││ Parsed result: {'RESULT': None} ││ Likely cause(s) and how to fix: ││ - OmniOpt found no result in stdout. Expected RESULT: . Make ││ sure your program prints the result to stdout. ││ - Missing numeric result(s) for: RESULT. ││ - Your program exited with code 5. Check the stderr/traceback above. ││ Relevant output (last lines): ││ This has stderr │││╰──────────────────────────────────────────────────────────────────────────────╯
⚠ Raw data does not conform to the expected structure. Expected either a tuple of (mean, SEM) or a float, but got None.╭────────────────OmniOpt evaluation failed - quick diagnosis─────────────────╮│││ Command: ││ ./.tests/test_wronggoing_stuff.bin/bin/signal_but_has_output ││ Working dir: /home/runner/work/OmniOpt/OmniOpt ││ Exit code: 137 ││ Signal: SIGKILL (9) ││ Parsed result: {'RESULT': None} ││ Likely cause(s) and how to fix: ││ - The process was killed by SIGKILL. This is often the OOM killer. Try ││ more memory (--mem_gb, currently 1 GB) or reduce the memory usage of your ││ program. ││ - Your program produced no stdout. OmniOpt reads results from stdout, so ││ print something like 'RESULT: 1.23'. ││ - Missing numeric result(s) for: RESULT. ││ Relevant output (last lines): ││ Killed ││ Killed │││╰──────────────────────────────────────────────────────────────────────────────╯
⚠ Raw data does not conform to the expected structure. Expected either a tuple of (mean, SEM) or a float, but got None.╭────────────────OmniOpt evaluation failed - quick diagnosis─────────────────╮│││ Command: ./.tests/test_wronggoing_stuff.bin/bin/module_not_found ││ Working dir: /home/runner/work/OmniOpt/OmniOpt ││ Exit code: 1 ││ Parsed result: {'RESULT': None} ││ Likely cause(s) and how to fix: ││ - The Python module 'THISMODULEDOESNTEXIST' is missing. Install it in ││ the environment used by your program, for example with 'pip install ││ THISMODULEDOESNTEXIST'. ││ - Your program raised a Python exception: ModuleNotFoundError: No module ││ named 'THISMODULEDOESNTEXIST'. Fix the traceback shown above. ││ - Your program produced no stdout. OmniOpt reads results from stdout, so ││ print something like 'RESULT: 1.23'. ││ - Missing numeric result(s) for: RESULT. ││ Relevant output (last lines): ││ Traceback (most recent call last): ││ File ││ "/home/runner/work/OmniOpt/OmniOpt/./.tests/test_wronggoing_stuff.bin/bin/ ││ module_not_found", line 3, in ││ import THISMODULEDOESNTEXIST ││ ModuleNotFoundError: No module named 'THISMODULEDOESNTEXIST' │││╰──────────────────────────────────────────────────────────────────────────────╯
⚠ Raw data does not conform to the expected structure. Expected either a tuple of (mean, SEM) or a float, but got None.╭────────────────OmniOpt evaluation failed - quick diagnosis─────────────────╮│││ Command: ││ ./.tests/test_wronggoing_stuff.bin/bin/result_but_exit_code_stdout_stderr ││ Working dir: /home/runner/work/OmniOpt/OmniOpt ││ Exit code: 5 ││ Parsed result: {'RESULT': 1596850632.0} ││ Likely cause(s) and how to fix: ││ - Your program produced a valid result but still exited with code 5. ││ OmniOpt may count this evaluation as successful; fix the exit code if that ││ is not intended. ││ Relevant output (last lines): ││ stderr │││╰──────────────────────────────────────────────────────────────────────────────╯╭────────────────OmniOpt evaluation failed - quick diagnosis─────────────────╮│││ Command: ││ ./.tests/test_wronggoing_stuff.bin/bin/tensorflow_syntax_error ││ Working dir: /home/runner/work/OmniOpt/OmniOpt ││ Exit code: 1 ││ Parsed result: {'RESULT': None} ││ Likely cause(s) and how to fix: ││ - The Python module 'tensorflow' is missing. Install it in the ││ environment used by your program, for example with 'pip install ││ tensorflow'. ││ - Your program raised a Python exception: ModuleNotFoundError: No module ││ named 'tensorflow'. Fix the traceback shown above. ││ - Your program produced no stdout. OmniOpt reads results from stdout, so ││ print something like 'RESULT: 1.23'. ││ - Missing numeric result(s) for: RESULT. ││ Relevant output (last lines): ││ Traceback (most recent call last): ││ File ││ "/home/runner/work/OmniOpt/OmniOpt/./.tests/test_wronggoing_stuff.bin/bin/ ││ tensorflow_syntax_error", line 3, in ││ import tensorflow as tf ││ ModuleNotFoundError: No module named 'tensorflow' │││╰──────────────────────────────────────────────────────────────────────────────╯
⚠ Raw data does not conform to the expected structure. Expected either a tuple of (mean, SEM) or a float, but got None.╭────────────────OmniOpt evaluation failed - quick diagnosis─────────────────╮│││ Command: ./.tests/test_wronggoing_stuff.bin/bin/file_does_not_exist ││ Working dir: /home/runner/work/OmniOpt/OmniOpt ││ Exit code: 127 ││ Parsed result: {'RESULT': None} ││ Likely cause(s) and how to fix: ││ - The command ││ './.tests/test_wronggoing_stuff.bin/bin/file_does_not_exist' was not ││ found. Check the spelling, your PATH and whether the program is installed ││ in the environment used by OmniOpt. ││ - Your program produced no stdout. OmniOpt reads results from stdout, so ││ print something like 'RESULT: 1.23'. ││ - Missing numeric result(s) for: RESULT. ││ Relevant output (last lines): ││ /bin/sh: 1: ./.tests/test_wronggoing_stuff.bin/bin/file_does_not_exist: ││ not found │││╰──────────────────────────────────────────────────────────────────────────────╯
⚠ Raw data does not conform to the expected structure. Expected either a tuple of (mean, SEM) or a float, but got None.╭────────────────OmniOpt evaluation failed - quick diagnosis─────────────────╮│││ Command: ./.tests/test_wronggoing_stuff.bin/bin/signal ││ Working dir: /home/runner/work/OmniOpt/OmniOpt ││ Exit code: 137 ││ Signal: SIGKILL (9) ││ Parsed result: {'RESULT': None} ││ Likely cause(s) and how to fix: ││ - The process was killed by SIGKILL. This is often the OOM killer. Try ││ more memory (--mem_gb, currently 1 GB) or reduce the memory usage of your ││ program. ││ - Your program produced no stdout. OmniOpt reads results from stdout, so ││ print something like 'RESULT: 1.23'. ││ - Missing numeric result(s) for: RESULT. ││ Relevant output (last lines): ││ Killed ││ Killed │││╰──────────────────────────────────────────────────────────────────────────────╯
⚠ Raw data does not conform to the expected structure. Expected either a tuple of (mean, SEM) or a float, but got None.╭────────────────OmniOpt evaluation failed - quick diagnosis─────────────────╮│││ Command: ./.tests/test_wronggoing_stuff.bin/bin/exit_code_137 ││ Working dir: /home/runner/work/OmniOpt/OmniOpt ││ Exit code: 137 ││ Signal: SIGKILL (9) ││ Parsed result: {'RESULT': None} ││ Likely cause(s) and how to fix: ││ - The process was killed by SIGKILL. This is often the OOM killer. Try ││ more memory (--mem_gb, currently 1 GB) or reduce the memory usage of your ││ program. ││ - Your program produced no stdout. OmniOpt reads results from stdout, so ││ print something like 'RESULT: 1.23'. ││ - Missing numeric result(s) for: RESULT. │││╰──────────────────────────────────────────────────────────────────────────────╯
⚠ Raw data does not conform to the expected structure. Expected either a tuple of (mean, SEM) or a float, but got None.╭────────────────OmniOpt evaluation failed - quick diagnosis─────────────────╮│││ Command: ./.tests/test_wronggoing_stuff.bin/bin/syntax_error ││ Working dir: /home/runner/work/OmniOpt/OmniOpt ││ Exit code: 1 ││ Parsed result: {'RESULT': None} ││ Likely cause(s) and how to fix: ││ - Your program produced no stdout. OmniOpt reads results from stdout, so ││ print something like 'RESULT: 1.23'. ││ - Missing numeric result(s) for: RESULT. ││ - Your program exited with code 1. Check the stderr/traceback above. ││ Relevant output (last lines): ││ File ││ "/home/runner/work/OmniOpt/OmniOpt/./.tests/test_wronggoing_stuff.bin/bin/ ││ syntax_error", line 3 ││ def x () {} ││ ^ ││ SyntaxError: expected ':' │││╰──────────────────────────────────────────────────────────────────────────────╯
⚠ Raw data does not conform to the expected structure. Expected either a tuple of (mean, SEM) or a float, but got None.╭────────────────OmniOpt evaluation failed - quick diagnosis─────────────────╮│││ Command: ./.tests/test_wronggoing_stuff.bin/bin/exit_code_no_output ││ Working dir: /home/runner/work/OmniOpt/OmniOpt ││ Exit code: 5 ││ Parsed result: {'RESULT': None} ││ Likely cause(s) and how to fix: ││ - Your program produced no stdout. OmniOpt reads results from stdout, so ││ print something like 'RESULT: 1.23'. ││ - Missing numeric result(s) for: RESULT. ││ - Your program exited with code 5. Check the stderr/traceback above. │││╰──────────────────────────────────────────────────────────────────────────────╯
⚠ Raw data does not conform to the expected structure. Expected either a tuple of (mean, SEM) or a float, but got None.╭────────────────OmniOpt evaluation failed - quick diagnosis─────────────────╮│││ Command: ./.tests/test_wronggoing_stuff.bin/bin/exit_code_stdout ││ Working dir: /home/runner/work/OmniOpt/OmniOpt ││ Exit code: 5 ││ Parsed result: {'RESULT': 1685100328.0} ││ Likely cause(s) and how to fix: ││ - Your program produced a valid result but still exited with code 5. ││ OmniOpt may count this evaluation as successful; fix the exit code if that ││ is not intended. ││ Relevant output (last lines): ││ STDERR │││╰──────────────────────────────────────────────────────────────────────────────╯╭────────────────OmniOpt evaluation failed - quick diagnosis─────────────────╮│││ Command: ./.tests/test_wronggoing_stuff.bin/bin/no_shebang ││ Working dir: /home/runner/work/OmniOpt/OmniOpt ││ Exit code: 2 ││ Parsed result: {'RESULT': None} ││ Likely cause(s) and how to fix: ││ - The command 'import' was not found. Check the spelling, your PATH and ││ whether the program is installed in the environment used by OmniOpt. ││ - Your program produced no stdout. OmniOpt reads results from stdout, so ││ print something like 'RESULT: 1.23'. ││ - Missing numeric result(s) for: RESULT. ││ Relevant output (last lines): ││ ./.tests/test_wronggoing_stuff.bin/bin/no_shebang: 1: import: not found ││ ./.tests/test_wronggoing_stuff.bin/bin/no_shebang: 2: Syntax error: word ││ unexpected (expecting ")") │││╰──────────────────────────────────────────────────────────────────────────────╯
⚠ Raw data does not conform to the expected structure. Expected either a tuple of (mean, SEM) or a float, but got None.╭────────────────OmniOpt evaluation failed - quick diagnosis─────────────────╮│││ Command: ./.tests/test_wronggoing_stuff.bin/bin/segfault ││ Working dir: /home/runner/work/OmniOpt/OmniOpt ││ Exit code: 139 ││ Signal: SIGSEGV (11) ││ Parsed result: {'RESULT': None} ││ Likely cause(s) and how to fix: ││ - The process crashed with SIGSEGV (segmentation fault). This usually ││ comes from native code, a broken C extension, CUDA/driver issues or ││ invalid memory access. ││ - Your program produced no stdout. OmniOpt reads results from stdout, so ││ print something like 'RESULT: 1.23'. ││ - Missing numeric result(s) for: RESULT. ││ Relevant output (last lines): ││ Segmentation fault (core dumped) │││╰──────────────────────────────────────────────────────────────────────────────╯
⚠ Raw data does not conform to the expected structure. Expected either a tuple of (mean, SEM) or a float, but got None.╭────────────────OmniOpt evaluation failed - quick diagnosis─────────────────╮│││ Command: ./.tests/test_wronggoing_stuff.bin/bin/empty ││ Working dir: /home/runner/work/OmniOpt/OmniOpt ││ Exit code: 126 ││ Parsed result: {'RESULT': None} ││ Likely cause(s) and how to fix: ││ - A file or command was not executable. Run 'chmod +x ' or ││ invoke the script explicitly with 'bash ' / 'python3 '. ││ - Your program produced no stdout. OmniOpt reads results from stdout, so ││ print something like 'RESULT: 1.23'. ││ - Missing numeric result(s) for: RESULT. ││ Relevant output (last lines): ││ /bin/sh: 1: ./.tests/test_wronggoing_stuff.bin/bin/empty: Permission ││ denied │││╰──────────────────────────────────────────────────────────────────────────────╯
⚠ Raw data does not conform to the expected structure. Expected either a tuple of (mean, SEM) or a float, but got None.╭────────────────OmniOpt evaluation failed - quick diagnosis─────────────────╮│││ Command: ││ ./.tests/test_wronggoing_stuff.bin/bin/force_keyboard_interrupt ││ Working dir: /home/runner/work/OmniOpt/OmniOpt ││ Exit code: 130 ││ Signal: SIGINT (2) ││ Parsed result: {'RESULT': None} ││ Likely cause(s) and how to fix: ││ - The process was terminated by SIGINT (2). ││ - Your program raised a Python exception: KeyboardInterrupt: Test error. ││ Fix the traceback shown above. ││ - Your program produced no stdout. OmniOpt reads results from stdout, so ││ print something like 'RESULT: 1.23'. ││ - Missing numeric result(s) for: RESULT. ││ Relevant output (last lines): ││ Traceback (most recent call last): ││ File ││ "/home/runner/work/OmniOpt/OmniOpt/./.tests/test_wronggoing_stuff.bin/bin/ ││ force_keyboard_interrupt", line 3, in ││ raise KeyboardInterrupt("Test error") ││ KeyboardInterrupt: Test error │││╰──────────────────────────────────────────────────────────────────────────────╯
⚠ Raw data does not conform to the expected structure. Expected either a tuple of (mean, SEM) or a float, but got None.╭────────────────OmniOpt evaluation failed - quick diagnosis─────────────────╮│││ Command: ./.tests/test_wronggoing_stuff.bin/bin/perl_module_fail ││ Working dir: /home/runner/work/OmniOpt/OmniOpt ││ Exit code: 2 ││ Parsed result: {'RESULT': None} ││ Likely cause(s) and how to fix: ││ - Your program produced no stdout. OmniOpt reads results from stdout, so ││ print something like 'RESULT: 1.23'. ││ - Missing numeric result(s) for: RESULT. ││ - Your program exited with code 2. Check the stderr/traceback above. ││ Relevant output (last lines): ││ Can't locate INeverExisted.pm in @INC (you may need to install the ││ INeverExisted module) (@INC entries checked: /etc/perl ││ /usr/local/lib/x86_64-linux-gnu/perl/5.38.2 /usr/local/share/perl/5.38.2 ││ /usr/lib/x86_64-linux-gnu/perl5/5.38 /usr/... ││ BEGIN failed--compilation aborted at ││ ./.tests/test_wronggoing_stuff.bin/bin/perl_module_fail line 3. │││╰──────────────────────────────────────────────────────────────────────────────╯
⚠ Raw data does not conform to the expected structure. Expected either a tuple of (mean, SEM) or a float, but got None.[omniopt] Only 0/1 unique points could be generated (retries=20/20, node=BOTORCH_MODULAR, duplicates=20, constraints=0, empty_batches=0). Details: /home/runner/work/OmniOpt/OmniOpt/runs/test_wronggoing_stuff/0/generation_debug.csv[omniopt] Only 0/1 unique points could be generated (retries=20/20, node=BOTORCH_MODULAR, duplicates=20, constraints=0, empty_batches=0). Details: /home/runner/work/OmniOpt/OmniOpt/runs/test_wronggoing_stuff/0/generation_debug.csv[omniopt] Only 0/1 unique points could be generated (retries=20/20, node=BOTORCH_MODULAR, duplicates=20, constraints=0, empty_batches=0). Details: /home/runner/work/OmniOpt/OmniOpt/runs/test_wronggoing_stuff/0/generation_debug.csv[omniopt] Only 0/1 unique points could be generated (retries=20/20, node=BOTORCH_MODULAR, duplicates=20, constraints=0, empty_batches=0). Details: /home/runner/work/OmniOpt/OmniOpt/runs/test_wronggoing_stuff/0/generation_debug.csv[omniopt] Only 0/1 unique points could be generated (retries=20/20, node=BOTORCH_MODULAR, duplicates=20, constraints=0, empty_batches=0). Details: /home/runner/work/OmniOpt/OmniOpt/runs/test_wronggoing_stuff/0/generation_debug.csv[omniopt] Only 0/1 unique points could be generated (retries=20/20, node=BOTORCH_MODULAR, duplicates=20, constraints=0, empty_batches=0). Details: /home/runner/work/OmniOpt/OmniOpt/runs/test_wronggoing_stuff/0/generation_debug.csv[omniopt] Only 0/1 unique points could be generated (retries=20/20, node=BOTORCH_MODULAR, duplicates=20, constraints=0, empty_batches=0). Details: /home/runner/work/OmniOpt/OmniOpt/runs/test_wronggoing_stuff/0/generation_debug.csvFailed Jobs parameters
┏━━━━━━━━┳━━━━━━━━┳━━━━━━━━┳━━━━━━━━━━━━━━━━━━━━━━━━━━━━━━━━━━━━━━━━━━━━━━━━━━━┓
┃param1┃param2┃param3┃error_description ┃
┡━━━━━━━━╇━━━━━━━━╇━━━━━━━━╇━━━━━━━━━━━━━━━━━━━━━━━━━━━━━━━━━━━━━━━━━━━━━━━━━━━┩
│value1│value2│value3│Some error occurred during execution (this is not│
││││a real error!). │
└────────┴────────┴────────┴───────────────────────────────────────────────────┘
Best RESULT, min (total: 5, failed: 18)
┏━━━━━━━━━━━━━━━┳━━━━━━━━━┳━━━━━━━━━━━━━━┓
┃status_reason┃program┃RESULT ┃
┡━━━━━━━━━━━━━━━╇━━━━━━━━━╇━━━━━━━━━━━━━━┩
│nan │perl │0.7413153454│
└───────────────┴─────────┴──────────────┘
Not printing sixel graphics in CI
Runtime Infos
┏━━━━━━━━━━━━━━━━━━━━━━━┳━━━━━━━━━━━┳━━━━━━━━━━━━┳━━━━━━━━━━━━━━┳━━━━━━━━━━━━━┓
┃Number of evaluations┃Min time ┃ Max time ┃Average time┃Median time┃
┡━━━━━━━━━━━━━━━━━━━━━━━╇━━━━━━━━━━━╇━━━━━━━━━━━━╇━━━━━━━━━━━━━━╇━━━━━━━━━━━━━┩
│ 23 │ 0.00 sec │ 12.00 sec │ 5.22 sec │ 6.00 sec │
└───────────────────────┴───────────┴────────────┴──────────────┴─────────────┘
╭────────────────────────────OmniOpt2 Run Summary────────────────────────────╮│││ ⚠️ Optimization finished with some failures││││ 📊 Trials: 5 succeeded / 18 failed / 5 done / 23 submitted ││ ⏱️ Duration: 593s (9m53s) ││ 🏆 Best RESULT: 0.7413153454 ││ 📁 Results: /home/runner/work/OmniOpt/OmniOpt/runs/test_wronggoing_stuff││ 🤖 Model: BOTORCH_MODULAR │││╰──────────────────────────────────────────────────────────────────────────────╯
2026-10-27 20:48:50 (15c20482-f413-4c21-b64f-e96885b7dad6): SOBOL, Started OmniOpt2 run...
2026-10-27 20:48:50 (15c20482-f413-4c21-b64f-e96885b7dad6): SOBOL, getting new HP set (no sbatch)
2026-10-27 20:48:50 (15c20482-f413-4c21-b64f-e96885b7dad6): SOBOL, requested 1 jobs, got 1, 0.04 s/job
2026-10-27 20:48:50 (15c20482-f413-4c21-b64f-e96885b7dad6): SOBOL, eval #1/1 start
2026-10-27 20:48:50 (15c20482-f413-4c21-b64f-e96885b7dad6): SOBOL, starting new job
2026-10-27 20:48:50 (15c20482-f413-4c21-b64f-e96885b7dad6): SOBOL, started new job
2026-10-27 20:49:00 (15c20482-f413-4c21-b64f-e96885b7dad6): SOBOL, new result: RESULT: 714489183.000000
2026-10-27 20:49:01 (15c20482-f413-4c21-b64f-e96885b7dad6): SOBOL, best RESULT: 714489183, finishing jobs (get_next_trials), finished 1 job
2026-10-27 20:49:02 (15c20482-f413-4c21-b64f-e96885b7dad6): BOTORCH_MODULAR, best RESULT: 714489183, getting new HP set (no sbatch)
2026-10-27 20:49:02 (15c20482-f413-4c21-b64f-e96885b7dad6): BOTORCH_MODULAR, best RESULT: 714489183, requested 1 jobs, got 1, 0.44 s/job
2026-10-27 20:49:02 (15c20482-f413-4c21-b64f-e96885b7dad6): BOTORCH_MODULAR, best RESULT: 714489183, eval #1/1 start
2026-10-27 20:49:02 (15c20482-f413-4c21-b64f-e96885b7dad6): BOTORCH_MODULAR, best RESULT: 714489183, starting new job
2026-10-27 20:49:02 (15c20482-f413-4c21-b64f-e96885b7dad6): BOTORCH_MODULAR, best RESULT: 714489183, started new job
2026-10-27 20:49:18 (15c20482-f413-4c21-b64f-e96885b7dad6): BOTORCH_MODULAR, best RESULT: 714489183, new result: RESULT: 1234.000000
2026-10-27 20:49:19 (15c20482-f413-4c21-b64f-e96885b7dad6): BOTORCH_MODULAR, best RESULT: 1234, ▁█, finishing jobs (get_next_trials), finished 1 job
2026-10-27 20:49:22 (15c20482-f413-4c21-b64f-e96885b7dad6): BOTORCH_MODULAR, best RESULT: 1234, ▁█, getting new HP set (no sbatch)
2026-10-27 20:49:22 (15c20482-f413-4c21-b64f-e96885b7dad6): BOTORCH_MODULAR, best RESULT: 1234, ▁█, requested 1 jobs, got 1, 3.27 s/job
2026-10-27 20:49:22 (15c20482-f413-4c21-b64f-e96885b7dad6): BOTORCH_MODULAR, best RESULT: 1234, ▁█, eval #1/1 start
2026-10-27 20:49:22 (15c20482-f413-4c21-b64f-e96885b7dad6): BOTORCH_MODULAR, best RESULT: 1234, ▁█, starting new job
2026-10-27 20:49:22 (15c20482-f413-4c21-b64f-e96885b7dad6): BOTORCH_MODULAR, best RESULT: 1234, ▁█, started new job
2026-10-27 20:49:26 (15c20482-f413-4c21-b64f-e96885b7dad6): BOTORCH_MODULAR, best RESULT: 1234, ▁█, job_failed
2026-10-27 20:49:27 (15c20482-f413-4c21-b64f-e96885b7dad6): BOTORCH_MODULAR, failed: 1 ('RESULT: <FLOAT>' not found), best RESULT: 1234, ▁█, finishing jobs (get_next_trials), finished 1 job
2026-10-27 20:49:30 (15c20482-f413-4c21-b64f-e96885b7dad6): BOTORCH_MODULAR, failed: 1 ('RESULT: <FLOAT>' not found), best RESULT: 1234, ▁█, getting new HP set (no sbatch)
2026-10-27 20:49:30 (15c20482-f413-4c21-b64f-e96885b7dad6): BOTORCH_MODULAR, failed: 1 ('RESULT: <FLOAT>' not found), best RESULT: 1234, ▁█, requested 1 jobs, got 1, 3.17 s/job
2026-10-27 20:49:30 (15c20482-f413-4c21-b64f-e96885b7dad6): BOTORCH_MODULAR, failed: 1 ('RESULT: <FLOAT>' not found), best RESULT: 1234, ▁█, eval #1/1 start
2026-10-27 20:49:30 (15c20482-f413-4c21-b64f-e96885b7dad6): BOTORCH_MODULAR, failed: 1 ('RESULT: <FLOAT>' not found), best RESULT: 1234, ▁█, starting new job
2026-10-27 20:49:30 (15c20482-f413-4c21-b64f-e96885b7dad6): BOTORCH_MODULAR, failed: 1 ('RESULT: <FLOAT>' not found), best RESULT: 1234, ▁█, started new job
2026-10-27 20:49:40 (15c20482-f413-4c21-b64f-e96885b7dad6): BOTORCH_MODULAR, failed: 1 ('RESULT: <FLOAT>' not found), best RESULT: 1234, ▁█, job_failed
2026-10-27 20:49:40 (15c20482-f413-4c21-b64f-e96885b7dad6): BOTORCH_MODULAR, failed: 2 ('RESULT: <FLOAT>' not found), best RESULT: 1234, ▁█, finishing jobs (get_next_trials), finished 1 job
2026-10-27 20:49:43 (15c20482-f413-4c21-b64f-e96885b7dad6): BOTORCH_MODULAR, failed: 2 ('RESULT: <FLOAT>' not found), best RESULT: 1234, ▁█, getting new HP set (no sbatch)
2026-10-27 20:49:43 (15c20482-f413-4c21-b64f-e96885b7dad6): BOTORCH_MODULAR, failed: 2 ('RESULT: <FLOAT>' not found), best RESULT: 1234, ▁█, requested 1 jobs, got 1, 3.34 s/job
2026-10-27 20:49:43 (15c20482-f413-4c21-b64f-e96885b7dad6): BOTORCH_MODULAR, failed: 2 ('RESULT: <FLOAT>' not found), best RESULT: 1234, ▁█, eval #1/1 start
2026-10-27 20:49:43 (15c20482-f413-4c21-b64f-e96885b7dad6): BOTORCH_MODULAR, failed: 2 ('RESULT: <FLOAT>' not found), best RESULT: 1234, ▁█, starting new job
2026-10-27 20:49:44 (15c20482-f413-4c21-b64f-e96885b7dad6): BOTORCH_MODULAR, failed: 2 ('RESULT: <FLOAT>' not found), best RESULT: 1234, ▁█, started new job
2026-10-27 20:49:48 (15c20482-f413-4c21-b64f-e96885b7dad6): BOTORCH_MODULAR, failed: 2 ('RESULT: <FLOAT>' not found), best RESULT: 1234, ▁█, job_failed
2026-10-27 20:49:48 (15c20482-f413-4c21-b64f-e96885b7dad6): BOTORCH_MODULAR, failed: 3 ('RESULT: <FLOAT>' not found), best RESULT: 1234, ▁█, finishing jobs (get_next_trials), finished 1 job
2026-10-27 20:49:51 (15c20482-f413-4c21-b64f-e96885b7dad6): BOTORCH_MODULAR, failed: 3 ('RESULT: <FLOAT>' not found), best RESULT: 1234, ▁█, getting new HP set (no sbatch)
2026-10-27 20:49:51 (15c20482-f413-4c21-b64f-e96885b7dad6): BOTORCH_MODULAR, failed: 3 ('RESULT: <FLOAT>' not found), best RESULT: 1234, ▁█, requested 1 jobs, got 1, 3.31 s/job
2026-10-27 20:49:51 (15c20482-f413-4c21-b64f-e96885b7dad6): BOTORCH_MODULAR, failed: 3 ('RESULT: <FLOAT>' not found), best RESULT: 1234, ▁█, eval #1/1 start
2026-10-27 20:49:51 (15c20482-f413-4c21-b64f-e96885b7dad6): BOTORCH_MODULAR, failed: 3 ('RESULT: <FLOAT>' not found), best RESULT: 1234, ▁█, starting new job
2026-10-27 20:49:51 (15c20482-f413-4c21-b64f-e96885b7dad6): BOTORCH_MODULAR, failed: 3 ('RESULT: <FLOAT>' not found), best RESULT: 1234, ▁█, started new job
2026-10-27 20:50:01 (15c20482-f413-4c21-b64f-e96885b7dad6): BOTORCH_MODULAR, failed: 3 ('RESULT: <FLOAT>' not found), best RESULT: 1234, ▁█, job_failed
2026-10-27 20:50:01 (15c20482-f413-4c21-b64f-e96885b7dad6): BOTORCH_MODULAR, failed: 4 ('RESULT: <FLOAT>' not found), best RESULT: 1234, ▁█, finishing jobs (get_next_trials), finished 1 job
2026-10-27 20:50:05 (15c20482-f413-4c21-b64f-e96885b7dad6): BOTORCH_MODULAR, failed: 4 ('RESULT: <FLOAT>' not found), best RESULT: 1234, ▁█, getting new HP set (no sbatch)
2026-10-27 20:50:05 (15c20482-f413-4c21-b64f-e96885b7dad6): BOTORCH_MODULAR, failed: 4 ('RESULT: <FLOAT>' not found), best RESULT: 1234, ▁█, requested 1 jobs, got 1, 3.57 s/job
2026-10-27 20:50:05 (15c20482-f413-4c21-b64f-e96885b7dad6): BOTORCH_MODULAR, failed: 4 ('RESULT: <FLOAT>' not found), best RESULT: 1234, ▁█, eval #1/1 start
2026-10-27 20:50:05 (15c20482-f413-4c21-b64f-e96885b7dad6): BOTORCH_MODULAR, failed: 4 ('RESULT: <FLOAT>' not found), best RESULT: 1234, ▁█, starting new job
2026-10-27 20:50:05 (15c20482-f413-4c21-b64f-e96885b7dad6): BOTORCH_MODULAR, failed: 4 ('RESULT: <FLOAT>' not found), best RESULT: 1234, ▁█, started new job
2026-10-27 20:50:15 (15c20482-f413-4c21-b64f-e96885b7dad6): BOTORCH_MODULAR, failed: 4 ('RESULT: <FLOAT>' not found), best RESULT: 1234, ▁█, job_failed
2026-10-27 20:50:15 (15c20482-f413-4c21-b64f-e96885b7dad6): BOTORCH_MODULAR, failed: 5 ('RESULT: <FLOAT>' not found), best RESULT: 1234, ▁█, finishing jobs (get_next_trials), finished 1 job
2026-10-27 20:50:18 (15c20482-f413-4c21-b64f-e96885b7dad6): BOTORCH_MODULAR, failed: 5 ('RESULT: <FLOAT>' not found), best RESULT: 1234, ▁█, getting new HP set (no sbatch)
2026-10-27 20:50:18 (15c20482-f413-4c21-b64f-e96885b7dad6): BOTORCH_MODULAR, failed: 5 ('RESULT: <FLOAT>' not found), best RESULT: 1234, ▁█, requested 1 jobs, got 1, 3.19 s/job
2026-10-27 20:50:19 (15c20482-f413-4c21-b64f-e96885b7dad6): BOTORCH_MODULAR, failed: 5 ('RESULT: <FLOAT>' not found), best RESULT: 1234, ▁█, eval #1/1 start
2026-10-27 20:50:19 (15c20482-f413-4c21-b64f-e96885b7dad6): BOTORCH_MODULAR, failed: 5 ('RESULT: <FLOAT>' not found), best RESULT: 1234, ▁█, starting new job
2026-10-27 20:50:19 (15c20482-f413-4c21-b64f-e96885b7dad6): BOTORCH_MODULAR, failed: 5 ('RESULT: <FLOAT>' not found), best RESULT: 1234, ▁█, started new job
2026-10-27 20:50:29 (15c20482-f413-4c21-b64f-e96885b7dad6): BOTORCH_MODULAR, failed: 5 ('RESULT: <FLOAT>' not found), best RESULT: 1234, ▁█, job_failed
2026-10-27 20:50:29 (15c20482-f413-4c21-b64f-e96885b7dad6): BOTORCH_MODULAR, failed: 6 ('RESULT: <FLOAT>' not found), best RESULT: 1234, ▁█, finishing jobs (get_next_trials), finished 1 job
2026-10-27 20:50:32 (15c20482-f413-4c21-b64f-e96885b7dad6): BOTORCH_MODULAR, failed: 6 ('RESULT: <FLOAT>' not found), best RESULT: 1234, ▁█, getting new HP set (no sbatch)
2026-10-27 20:50:32 (15c20482-f413-4c21-b64f-e96885b7dad6): BOTORCH_MODULAR, failed: 6 ('RESULT: <FLOAT>' not found), best RESULT: 1234, ▁█, requested 1 jobs, got 1, 3.16 s/job
2026-10-27 20:50:32 (15c20482-f413-4c21-b64f-e96885b7dad6): BOTORCH_MODULAR, failed: 6 ('RESULT: <FLOAT>' not found), best RESULT: 1234, ▁█, eval #1/1 start
2026-10-27 20:50:32 (15c20482-f413-4c21-b64f-e96885b7dad6): BOTORCH_MODULAR, failed: 6 ('RESULT: <FLOAT>' not found), best RESULT: 1234, ▁█, starting new job
2026-10-27 20:50:32 (15c20482-f413-4c21-b64f-e96885b7dad6): BOTORCH_MODULAR, failed: 6 ('RESULT: <FLOAT>' not found), best RESULT: 1234, ▁█, started new job
2026-10-27 20:50:42 (15c20482-f413-4c21-b64f-e96885b7dad6): BOTORCH_MODULAR, failed: 6 ('RESULT: <FLOAT>' not found), best RESULT: 1234, ▁█, job_failed
2026-10-27 20:50:42 (15c20482-f413-4c21-b64f-e96885b7dad6): BOTORCH_MODULAR, failed: 7 ('RESULT: <FLOAT>' not found), best RESULT: 1234, ▁█, finishing jobs (get_next_trials), finished 1 job
2026-10-27 20:50:46 (15c20482-f413-4c21-b64f-e96885b7dad6): BOTORCH_MODULAR, failed: 7 ('RESULT: <FLOAT>' not found), best RESULT: 1234, ▁█, getting new HP set (no sbatch)
2026-10-27 20:50:46 (15c20482-f413-4c21-b64f-e96885b7dad6): BOTORCH_MODULAR, failed: 7 ('RESULT: <FLOAT>' not found), best RESULT: 1234, ▁█, requested 1 jobs, got 1, 3.36 s/job
2026-10-27 20:50:46 (15c20482-f413-4c21-b64f-e96885b7dad6): BOTORCH_MODULAR, failed: 7 ('RESULT: <FLOAT>' not found), best RESULT: 1234, ▁█, eval #1/1 start
2026-10-27 20:50:46 (15c20482-f413-4c21-b64f-e96885b7dad6): BOTORCH_MODULAR, failed: 7 ('RESULT: <FLOAT>' not found), best RESULT: 1234, ▁█, starting new job
2026-10-27 20:50:46 (15c20482-f413-4c21-b64f-e96885b7dad6): BOTORCH_MODULAR, failed: 7 ('RESULT: <FLOAT>' not found), best RESULT: 1234, ▁█, started new job
2026-10-27 20:50:57 (15c20482-f413-4c21-b64f-e96885b7dad6): BOTORCH_MODULAR, failed: 7 ('RESULT: <FLOAT>' not found), best RESULT: 1234, ▁█, new result: RESULT: 1596850632.000000
2026-10-27 20:50:59 (15c20482-f413-4c21-b64f-e96885b7dad6): BOTORCH_MODULAR, failed: 7 ('RESULT: <FLOAT>' not found), best RESULT: 1234, ▄█▁, finishing jobs, finished 1 job
2026-10-27 20:51:02 (15c20482-f413-4c21-b64f-e96885b7dad6): BOTORCH_MODULAR, failed: 7 ('RESULT: <FLOAT>' not found), best RESULT: 1234, ▄█▁, getting new HP set (no sbatch)
2026-10-27 20:51:02 (15c20482-f413-4c21-b64f-e96885b7dad6): BOTORCH_MODULAR, failed: 7 ('RESULT: <FLOAT>' not found), best RESULT: 1234, ▄█▁, requested 1 jobs, got 1, 3.21 s/job
2026-10-27 20:51:02 (15c20482-f413-4c21-b64f-e96885b7dad6): BOTORCH_MODULAR, failed: 7 ('RESULT: <FLOAT>' not found), best RESULT: 1234, ▄█▁, eval #1/1 start
2026-10-27 20:51:02 (15c20482-f413-4c21-b64f-e96885b7dad6): BOTORCH_MODULAR, failed: 7 ('RESULT: <FLOAT>' not found), best RESULT: 1234, ▄█▁, starting new job
2026-10-27 20:51:02 (15c20482-f413-4c21-b64f-e96885b7dad6): BOTORCH_MODULAR, failed: 7 ('RESULT: <FLOAT>' not found), best RESULT: 1234, ▄█▁, started new job
2026-10-27 20:51:12 (15c20482-f413-4c21-b64f-e96885b7dad6): BOTORCH_MODULAR, failed: 7 ('RESULT: <FLOAT>' not found), best RESULT: 1234, ▄█▁, job_failed
2026-10-27 20:51:12 (15c20482-f413-4c21-b64f-e96885b7dad6): BOTORCH_MODULAR, failed: 8 ('RESULT: <FLOAT>' not found), best RESULT: 1234, ▄█▁, finishing jobs (get_next_trials), finished 1 job
2026-10-27 20:51:15 (15c20482-f413-4c21-b64f-e96885b7dad6): BOTORCH_MODULAR, failed: 8 ('RESULT: <FLOAT>' not found), best RESULT: 1234, ▄█▁, getting new HP set (no sbatch)
2026-10-27 20:51:15 (15c20482-f413-4c21-b64f-e96885b7dad6): BOTORCH_MODULAR, failed: 8 ('RESULT: <FLOAT>' not found), best RESULT: 1234, ▄█▁, requested 1 jobs, got 1, 3.09 s/job
2026-10-27 20:51:15 (15c20482-f413-4c21-b64f-e96885b7dad6): BOTORCH_MODULAR, failed: 8 ('RESULT: <FLOAT>' not found), best RESULT: 1234, ▄█▁, eval #1/1 start
2026-10-27 20:51:16 (15c20482-f413-4c21-b64f-e96885b7dad6): BOTORCH_MODULAR, failed: 8 ('RESULT: <FLOAT>' not found), best RESULT: 1234, ▄█▁, starting new job
2026-10-27 20:51:16 (15c20482-f413-4c21-b64f-e96885b7dad6): BOTORCH_MODULAR, failed: 8 ('RESULT: <FLOAT>' not found), best RESULT: 1234, ▄█▁, started new job
2026-10-27 20:51:21 (15c20482-f413-4c21-b64f-e96885b7dad6): BOTORCH_MODULAR, failed: 8 ('RESULT: <FLOAT>' not found), best RESULT: 1234, ▄█▁, job_failed
2026-10-27 20:51:21 (15c20482-f413-4c21-b64f-e96885b7dad6): BOTORCH_MODULAR, failed: 9 ('RESULT: <FLOAT>' not found), best RESULT: 1234, ▄█▁, finishing jobs (get_next_trials), finished 1 job
2026-10-27 20:51:24 (15c20482-f413-4c21-b64f-e96885b7dad6): BOTORCH_MODULAR, failed: 9 ('RESULT: <FLOAT>' not found), best RESULT: 1234, ▄█▁, getting new HP set (no sbatch)
2026-10-27 20:51:24 (15c20482-f413-4c21-b64f-e96885b7dad6): BOTORCH_MODULAR, failed: 9 ('RESULT: <FLOAT>' not found), best RESULT: 1234, ▄█▁, requested 1 jobs, got 1, 3.03 s/job
2026-10-27 20:51:24 (15c20482-f413-4c21-b64f-e96885b7dad6): BOTORCH_MODULAR, failed: 9 ('RESULT: <FLOAT>' not found), best RESULT: 1234, ▄█▁, eval #1/1 start
2026-10-27 20:51:24 (15c20482-f413-4c21-b64f-e96885b7dad6): BOTORCH_MODULAR, failed: 9 ('RESULT: <FLOAT>' not found), best RESULT: 1234, ▄█▁, starting new job
2026-10-27 20:51:24 (15c20482-f413-4c21-b64f-e96885b7dad6): BOTORCH_MODULAR, failed: 9 ('RESULT: <FLOAT>' not found), best RESULT: 1234, ▄█▁, started new job
2026-10-27 20:51:35 (15c20482-f413-4c21-b64f-e96885b7dad6): BOTORCH_MODULAR, failed: 9 ('RESULT: <FLOAT>' not found), best RESULT: 1234, ▄█▁, job_failed
2026-10-27 20:51:35 (15c20482-f413-4c21-b64f-e96885b7dad6): BOTORCH_MODULAR, failed: 10 ('RESULT: <FLOAT>' not found), best RESULT: 1234, ▄█▁, finishing jobs (get_next_trials), finished 1 job
2026-10-27 20:51:39 (15c20482-f413-4c21-b64f-e96885b7dad6): BOTORCH_MODULAR, failed: 10 ('RESULT: <FLOAT>' not found), best RESULT: 1234, ▄█▁, getting new HP set (no sbatch)
2026-10-27 20:51:39 (15c20482-f413-4c21-b64f-e96885b7dad6): BOTORCH_MODULAR, failed: 10 ('RESULT: <FLOAT>' not found), best RESULT: 1234, ▄█▁, requested 1 jobs, got 1, 3.18 s/job
2026-10-27 20:51:39 (15c20482-f413-4c21-b64f-e96885b7dad6): BOTORCH_MODULAR, failed: 10 ('RESULT: <FLOAT>' not found), best RESULT: 1234, ▄█▁, eval #1/1 start
2026-10-27 20:51:39 (15c20482-f413-4c21-b64f-e96885b7dad6): BOTORCH_MODULAR, failed: 10 ('RESULT: <FLOAT>' not found), best RESULT: 1234, ▄█▁, starting new job
2026-10-27 20:51:39 (15c20482-f413-4c21-b64f-e96885b7dad6): BOTORCH_MODULAR, failed: 10 ('RESULT: <FLOAT>' not found), best RESULT: 1234, ▄█▁, started new job
2026-10-27 20:51:49 (15c20482-f413-4c21-b64f-e96885b7dad6): BOTORCH_MODULAR, failed: 10 ('RESULT: <FLOAT>' not found), best RESULT: 1234, ▄█▁, job_failed
2026-10-27 20:51:49 (15c20482-f413-4c21-b64f-e96885b7dad6): BOTORCH_MODULAR, failed: 11 ('RESULT: <FLOAT>' not found), best RESULT: 1234, ▄█▁, finishing jobs (get_next_trials), finished 1 job
2026-10-27 20:51:52 (15c20482-f413-4c21-b64f-e96885b7dad6): BOTORCH_MODULAR, failed: 11 ('RESULT: <FLOAT>' not found), best RESULT: 1234, ▄█▁, getting new HP set (no sbatch)
2026-10-27 20:51:52 (15c20482-f413-4c21-b64f-e96885b7dad6): BOTORCH_MODULAR, failed: 11 ('RESULT: <FLOAT>' not found), best RESULT: 1234, ▄█▁, requested 1 jobs, got 1, 3.07 s/job
2026-10-27 20:51:52 (15c20482-f413-4c21-b64f-e96885b7dad6): BOTORCH_MODULAR, failed: 11 ('RESULT: <FLOAT>' not found), best RESULT: 1234, ▄█▁, eval #1/1 start
2026-10-27 20:51:52 (15c20482-f413-4c21-b64f-e96885b7dad6): BOTORCH_MODULAR, failed: 11 ('RESULT: <FLOAT>' not found), best RESULT: 1234, ▄█▁, starting new job
2026-10-27 20:51:52 (15c20482-f413-4c21-b64f-e96885b7dad6): BOTORCH_MODULAR, failed: 11 ('RESULT: <FLOAT>' not found), best RESULT: 1234, ▄█▁, started new job
2026-10-27 20:52:02 (15c20482-f413-4c21-b64f-e96885b7dad6): BOTORCH_MODULAR, failed: 11 ('RESULT: <FLOAT>' not found), best RESULT: 1234, ▄█▁, new result: RESULT: 0.741315
2026-10-27 20:52:04 (15c20482-f413-4c21-b64f-e96885b7dad6): BOTORCH_MODULAR, failed: 11 ('RESULT: <FLOAT>' not found), best RESULT: 0.741315345353545, ▄▇▁█, finishing jobs (get_next_trials), finished 1 job
2026-10-27 20:52:08 (15c20482-f413-4c21-b64f-e96885b7dad6): BOTORCH_MODULAR, failed: 11 ('RESULT: <FLOAT>' not found), best RESULT: 0.741315345353545, ▄▇▁█, getting new HP set (no sbatch)
2026-10-27 20:52:12 (15c20482-f413-4c21-b64f-e96885b7dad6): BOTORCH_MODULAR, failed: 11 ('RESULT: <FLOAT>' not found), best RESULT: 0.741315345353545, ▄▇▁█, requested 1 jobs, got 1, 7.84 s/job
2026-10-27 20:52:12 (15c20482-f413-4c21-b64f-e96885b7dad6): BOTORCH_MODULAR, failed: 11 ('RESULT: <FLOAT>' not found), best RESULT: 0.741315345353545, ▄▇▁█, eval #1/1 start
2026-10-27 20:52:12 (15c20482-f413-4c21-b64f-e96885b7dad6): BOTORCH_MODULAR, failed: 11 ('RESULT: <FLOAT>' not found), best RESULT: 0.741315345353545, ▄▇▁█, starting new job
2026-10-27 20:52:12 (15c20482-f413-4c21-b64f-e96885b7dad6): BOTORCH_MODULAR, failed: 11 ('RESULT: <FLOAT>' not found), best RESULT: 0.741315345353545, ▄▇▁█, started new job
2026-10-27 20:52:23 (15c20482-f413-4c21-b64f-e96885b7dad6): BOTORCH_MODULAR, failed: 11 ('RESULT: <FLOAT>' not found), best RESULT: 0.741315345353545, ▄▇▁█, job_failed
2026-10-27 20:52:23 (15c20482-f413-4c21-b64f-e96885b7dad6): BOTORCH_MODULAR, failed: 12 ('RESULT: <FLOAT>' not found), best RESULT: 0.7413153454, ▄▇▁█, finishing jobs (get_next_trials), finished 1 job
2026-10-27 20:52:27 (15c20482-f413-4c21-b64f-e96885b7dad6): BOTORCH_MODULAR, failed: 12 ('RESULT: <FLOAT>' not found), best RESULT: 0.7413153454, ▄▇▁█, getting new HP set (no sbatch)
2026-10-27 20:52:45 (15c20482-f413-4c21-b64f-e96885b7dad6): BOTORCH_MODULAR, failed: 12 ('RESULT: <FLOAT>' not found), best RESULT: 0.7413153454, ▄▇▁█, requested 1 jobs, got 1, 21.65 s/job
2026-10-27 20:52:45 (15c20482-f413-4c21-b64f-e96885b7dad6): BOTORCH_MODULAR, failed: 12 ('RESULT: <FLOAT>' not found), best RESULT: 0.7413153454, ▄▇▁█, eval #1/1 start
2026-10-27 20:52:45 (15c20482-f413-4c21-b64f-e96885b7dad6): BOTORCH_MODULAR, failed: 12 ('RESULT: <FLOAT>' not found), best RESULT: 0.7413153454, ▄▇▁█, starting new job
2026-10-27 20:52:45 (15c20482-f413-4c21-b64f-e96885b7dad6): BOTORCH_MODULAR, failed: 12 ('RESULT: <FLOAT>' not found), best RESULT: 0.7413153454, ▄▇▁█, started new job
2026-10-27 20:52:55 (15c20482-f413-4c21-b64f-e96885b7dad6): BOTORCH_MODULAR, failed: 12 ('RESULT: <FLOAT>' not found), best RESULT: 0.7413153454, ▄▇▁█, job_failed
2026-10-27 20:52:55 (15c20482-f413-4c21-b64f-e96885b7dad6): BOTORCH_MODULAR, failed: 13 ('RESULT: <FLOAT>' not found), best RESULT: 0.7413153454, ▄▇▁█, finishing jobs (get_next_trials), finished 1 job
2026-10-27 20:52:59 (15c20482-f413-4c21-b64f-e96885b7dad6): BOTORCH_MODULAR, failed: 13 ('RESULT: <FLOAT>' not found), best RESULT: 0.7413153454, ▄▇▁█, getting new HP set (no sbatch)
2026-10-27 20:53:11 (15c20482-f413-4c21-b64f-e96885b7dad6): BOTORCH_MODULAR, failed: 13 ('RESULT: <FLOAT>' not found), best RESULT: 0.7413153454, ▄▇▁█, requested 1 jobs, got 1, 15.05 s/job
2026-10-27 20:53:11 (15c20482-f413-4c21-b64f-e96885b7dad6): BOTORCH_MODULAR, failed: 13 ('RESULT: <FLOAT>' not found), best RESULT: 0.7413153454, ▄▇▁█, eval #1/1 start
2026-10-27 20:53:11 (15c20482-f413-4c21-b64f-e96885b7dad6): BOTORCH_MODULAR, failed: 13 ('RESULT: <FLOAT>' not found), best RESULT: 0.7413153454, ▄▇▁█, starting new job
2026-10-27 20:53:11 (15c20482-f413-4c21-b64f-e96885b7dad6): BOTORCH_MODULAR, failed: 13 ('RESULT: <FLOAT>' not found), best RESULT: 0.7413153454, ▄▇▁█, started new job
2026-10-27 20:53:22 (15c20482-f413-4c21-b64f-e96885b7dad6): BOTORCH_MODULAR, failed: 13 ('RESULT: <FLOAT>' not found), best RESULT: 0.7413153454, ▄▇▁█, new result: RESULT: 1685100328.000000
2026-10-27 20:53:24 (15c20482-f413-4c21-b64f-e96885b7dad6): BOTORCH_MODULAR, failed: 13 ('RESULT: <FLOAT>' not found), best RESULT: 0.7413153454, ▅▇▁█▁, finishing jobs (get_next_trials), finished 1 job
2026-10-27 20:53:25 (15c20482-f413-4c21-b64f-e96885b7dad6): BOTORCH_MODULAR, failed: 13 ('RESULT: <FLOAT>' not found), best RESULT: 0.7413153454, ▅▇▁█▁, getting new HP set (no sbatch)
2026-10-27 20:53:28 (15c20482-f413-4c21-b64f-e96885b7dad6): BOTORCH_MODULAR, failed: 13 ('RESULT: <FLOAT>' not found), best RESULT: 0.7413153454, ▅▇▁█▁, requested 1 jobs, got 1, 4.58 s/job
2026-10-27 20:53:28 (15c20482-f413-4c21-b64f-e96885b7dad6): BOTORCH_MODULAR, failed: 13 ('RESULT: <FLOAT>' not found), best RESULT: 0.7413153454, ▅▇▁█▁, eval #1/1 start
2026-10-27 20:53:28 (15c20482-f413-4c21-b64f-e96885b7dad6): BOTORCH_MODULAR, failed: 13 ('RESULT: <FLOAT>' not found), best RESULT: 0.7413153454, ▅▇▁█▁, starting new job
2026-10-27 20:53:28 (15c20482-f413-4c21-b64f-e96885b7dad6): BOTORCH_MODULAR, failed: 13 ('RESULT: <FLOAT>' not found), best RESULT: 0.7413153454, ▅▇▁█▁, started new job
2026-10-27 20:53:39 (15c20482-f413-4c21-b64f-e96885b7dad6): BOTORCH_MODULAR, failed: 13 ('RESULT: <FLOAT>' not found), best RESULT: 0.7413153454, ▅▇▁█▁, job_failed
2026-10-27 20:53:40 (15c20482-f413-4c21-b64f-e96885b7dad6): BOTORCH_MODULAR, failed: 14 ('RESULT: <FLOAT>' not found), best RESULT: 0.7413153454, ▅▇▁█▁, finishing jobs (get_next_trials), finished 1 job
2026-10-27 20:53:41 (15c20482-f413-4c21-b64f-e96885b7dad6): BOTORCH_MODULAR, failed: 14 ('RESULT: <FLOAT>' not found), best RESULT: 0.7413153454, ▅▇▁█▁, getting new HP set (no sbatch)
2026-10-27 20:53:45 (15c20482-f413-4c21-b64f-e96885b7dad6): BOTORCH_MODULAR, failed: 14 ('RESULT: <FLOAT>' not found), best RESULT: 0.7413153454, ▅▇▁█▁, requested 1 jobs, got 1, 5.07 s/job
2026-10-27 20:53:45 (15c20482-f413-4c21-b64f-e96885b7dad6): BOTORCH_MODULAR, failed: 14 ('RESULT: <FLOAT>' not found), best RESULT: 0.7413153454, ▅▇▁█▁, eval #1/1 start
2026-10-27 20:53:45 (15c20482-f413-4c21-b64f-e96885b7dad6): BOTORCH_MODULAR, failed: 14 ('RESULT: <FLOAT>' not found), best RESULT: 0.7413153454, ▅▇▁█▁, starting new job
2026-10-27 20:53:45 (15c20482-f413-4c21-b64f-e96885b7dad6): BOTORCH_MODULAR, failed: 14 ('RESULT: <FLOAT>' not found), best RESULT: 0.7413153454, ▅▇▁█▁, started new job
2026-10-27 20:53:56 (15c20482-f413-4c21-b64f-e96885b7dad6): BOTORCH_MODULAR, failed: 14 ('RESULT: <FLOAT>' not found), best RESULT: 0.7413153454, ▅▇▁█▁, job_failed
2026-10-27 20:53:57 (15c20482-f413-4c21-b64f-e96885b7dad6): BOTORCH_MODULAR, failed: 15 ('RESULT: <FLOAT>' not found), best RESULT: 0.7413153454, ▅▇▁█▁, finishing jobs, finished 1 job
2026-10-27 20:53:58 (15c20482-f413-4c21-b64f-e96885b7dad6): BOTORCH_MODULAR, failed: 15 ('RESULT: <FLOAT>' not found), best RESULT: 0.7413153454, ▅▇▁█▁, getting new HP set (no sbatch)
2026-10-27 20:54:01 (15c20482-f413-4c21-b64f-e96885b7dad6): BOTORCH_MODULAR, failed: 15 ('RESULT: <FLOAT>' not found), best RESULT: 0.7413153454, ▅▇▁█▁, requested 1 jobs, got 1, 4.62 s/job
2026-10-27 20:54:01 (15c20482-f413-4c21-b64f-e96885b7dad6): BOTORCH_MODULAR, failed: 15 ('RESULT: <FLOAT>' not found), best RESULT: 0.7413153454, ▅▇▁█▁, eval #1/1 start
2026-10-27 20:54:01 (15c20482-f413-4c21-b64f-e96885b7dad6): BOTORCH_MODULAR, failed: 15 ('RESULT: <FLOAT>' not found), best RESULT: 0.7413153454, ▅▇▁█▁, starting new job
2026-10-27 20:54:01 (15c20482-f413-4c21-b64f-e96885b7dad6): BOTORCH_MODULAR, failed: 15 ('RESULT: <FLOAT>' not found), best RESULT: 0.7413153454, ▅▇▁█▁, started new job
2026-10-27 20:54:06 (15c20482-f413-4c21-b64f-e96885b7dad6): BOTORCH_MODULAR, failed: 15 ('RESULT: <FLOAT>' not found), best RESULT: 0.7413153454, ▅▇▁█▁, job_failed
2026-10-27 20:54:07 (15c20482-f413-4c21-b64f-e96885b7dad6): BOTORCH_MODULAR, failed: 16 ('RESULT: <FLOAT>' not found), best RESULT: 0.7413153454, ▅▇▁█▁, finishing jobs (get_next_trials), finished 1 job
2026-10-27 20:54:09 (15c20482-f413-4c21-b64f-e96885b7dad6): BOTORCH_MODULAR, failed: 16 ('RESULT: <FLOAT>' not found), best RESULT: 0.7413153454, ▅▇▁█▁, getting new HP set (no sbatch)
2026-10-27 20:54:09 (15c20482-f413-4c21-b64f-e96885b7dad6): BOTORCH_MODULAR, failed: 16 ('RESULT: <FLOAT>' not found), best RESULT: 0.7413153454, ▅▇▁█▁, requested 1 jobs, got 1, 1.65 s/job
2026-10-27 20:54:09 (15c20482-f413-4c21-b64f-e96885b7dad6): BOTORCH_MODULAR, failed: 16 ('RESULT: <FLOAT>' not found), best RESULT: 0.7413153454, ▅▇▁█▁, eval #1/1 start
2026-10-27 20:54:09 (15c20482-f413-4c21-b64f-e96885b7dad6): BOTORCH_MODULAR, failed: 16 ('RESULT: <FLOAT>' not found), best RESULT: 0.7413153454, ▅▇▁█▁, starting new job
2026-10-27 20:54:09 (15c20482-f413-4c21-b64f-e96885b7dad6): BOTORCH_MODULAR, failed: 16 ('RESULT: <FLOAT>' not found), best RESULT: 0.7413153454, ▅▇▁█▁, started new job
2026-10-27 20:54:20 (15c20482-f413-4c21-b64f-e96885b7dad6): BOTORCH_MODULAR, failed: 16 ('RESULT: <FLOAT>' not found), best RESULT: 0.7413153454, ▅▇▁█▁, job_failed
2026-10-27 20:54:20 (15c20482-f413-4c21-b64f-e96885b7dad6): BOTORCH_MODULAR, failed: 17 ('RESULT: <FLOAT>' not found), best RESULT: 0.7413153454, ▅▇▁█▁, finishing jobs (get_next_trials), finished 1 job
2026-10-27 20:54:22 (15c20482-f413-4c21-b64f-e96885b7dad6): BOTORCH_MODULAR, failed: 17 ('RESULT: <FLOAT>' not found), best RESULT: 0.7413153454, ▅▇▁█▁, getting new HP set (no sbatch)
2026-10-27 20:54:30 (15c20482-f413-4c21-b64f-e96885b7dad6): BOTORCH_MODULAR, failed: 17 ('RESULT: <FLOAT>' not found), best RESULT: 0.7413153454, ▅▇▁█▁, requested 1 jobs, got 1, 9.38 s/job
2026-10-27 20:54:30 (15c20482-f413-4c21-b64f-e96885b7dad6): BOTORCH_MODULAR, failed: 17 ('RESULT: <FLOAT>' not found), best RESULT: 0.7413153454, ▅▇▁█▁, eval #1/1 start
2026-10-27 20:54:30 (15c20482-f413-4c21-b64f-e96885b7dad6): BOTORCH_MODULAR, failed: 17 ('RESULT: <FLOAT>' not found), best RESULT: 0.7413153454, ▅▇▁█▁, starting new job
2026-10-27 20:54:30 (15c20482-f413-4c21-b64f-e96885b7dad6): BOTORCH_MODULAR, failed: 17 ('RESULT: <FLOAT>' not found), best RESULT: 0.7413153454, ▅▇▁█▁, started new job
2026-10-27 20:54:41 (15c20482-f413-4c21-b64f-e96885b7dad6): BOTORCH_MODULAR, failed: 17 ('RESULT: <FLOAT>' not found), best RESULT: 0.7413153454, ▅▇▁█▁, job_failed
2026-10-27 20:54:41 (15c20482-f413-4c21-b64f-e96885b7dad6): BOTORCH_MODULAR, failed: 18 ('RESULT: <FLOAT>' not found), best RESULT: 0.7413153454, ▅▇▁█▁, finishing jobs (get_next_trials), finished 1 job
2026-10-27 20:54:44 (15c20482-f413-4c21-b64f-e96885b7dad6): BOTORCH_MODULAR, failed: 18 ('RESULT: <FLOAT>' not found), best RESULT: 0.7413153454, ▅▇▁█▁, getting new HP set (no sbatch)
2026-10-27 20:55:16 (15c20482-f413-4c21-b64f-e96885b7dad6): BOTORCH_MODULAR, failed: 18 ('RESULT: <FLOAT>' not found), best RESULT: 0.7413153454, ▅▇▁█▁, requested 1 jobs, got 0, n/a
2026-10-27 20:55:17 (15c20482-f413-4c21-b64f-e96885b7dad6): BOTORCH_MODULAR, failed: 18 ('RESULT: <FLOAT>' not found), best RESULT: 0.7413153454, ▅▇▁█▁, getting new HP set (no sbatch)
2026-10-27 20:55:50 (15c20482-f413-4c21-b64f-e96885b7dad6): BOTORCH_MODULAR, failed: 18 ('RESULT: <FLOAT>' not found), best RESULT: 0.7413153454, ▅▇▁█▁, requested 1 jobs, got 0, n/a
2026-10-27 20:55:52 (15c20482-f413-4c21-b64f-e96885b7dad6): BOTORCH_MODULAR, failed: 18 ('RESULT: <FLOAT>' not found), best RESULT: 0.7413153454, ▅▇▁█▁, getting new HP set (no sbatch)
2026-10-27 20:56:26 (15c20482-f413-4c21-b64f-e96885b7dad6): BOTORCH_MODULAR, failed: 18 ('RESULT: <FLOAT>' not found), best RESULT: 0.7413153454, ▅▇▁█▁, requested 1 jobs, got 0, n/a
2026-10-27 20:56:29 (15c20482-f413-4c21-b64f-e96885b7dad6): BOTORCH_MODULAR, failed: 18 ('RESULT: <FLOAT>' not found), best RESULT: 0.7413153454, ▅▇▁█▁, getting new HP set (no sbatch)
2026-10-27 20:56:57 (15c20482-f413-4c21-b64f-e96885b7dad6): BOTORCH_MODULAR, failed: 18 ('RESULT: <FLOAT>' not found), best RESULT: 0.7413153454, ▅▇▁█▁, requested 1 jobs, got 0, n/a
2026-10-27 20:56:58 (15c20482-f413-4c21-b64f-e96885b7dad6): BOTORCH_MODULAR, failed: 18 ('RESULT: <FLOAT>' not found), best RESULT: 0.7413153454, ▅▇▁█▁, getting new HP set (no sbatch)
2026-10-27 20:57:29 (15c20482-f413-4c21-b64f-e96885b7dad6): BOTORCH_MODULAR, failed: 18 ('RESULT: <FLOAT>' not found), best RESULT: 0.7413153454, ▅▇▁█▁, requested 1 jobs, got 0, n/a
2026-10-27 20:57:30 (15c20482-f413-4c21-b64f-e96885b7dad6): BOTORCH_MODULAR, failed: 18 ('RESULT: <FLOAT>' not found), best RESULT: 0.7413153454, ▅▇▁█▁, getting new HP set (no sbatch)
2026-10-27 20:58:01 (15c20482-f413-4c21-b64f-e96885b7dad6): BOTORCH_MODULAR, failed: 18 ('RESULT: <FLOAT>' not found), best RESULT: 0.7413153454, ▅▇▁█▁, requested 1 jobs, got 0, n/a
2026-10-27 20:58:02 (15c20482-f413-4c21-b64f-e96885b7dad6): BOTORCH_MODULAR, failed: 18 ('RESULT: <FLOAT>' not found), best RESULT: 0.7413153454, ▅▇▁█▁, getting new HP set (no sbatch)
2026-10-27 20:58:31 (15c20482-f413-4c21-b64f-e96885b7dad6): BOTORCH_MODULAR, failed: 18 ('RESULT: <FLOAT>' not found), best RESULT: 0.7413153454, ▅▇▁█▁, requested 1 jobs, got 0, n/a
2026-10-27 20:58:31 (15c20482-f413-4c21-b64f-e96885b7dad6): BOTORCH_MODULAR, failed: 18 ('RESULT: <FLOAT>' not found), best RESULT: 0.7413153454, ▅▇▁█▁, found 1 zero-jobs (max: 3)
! No notable correlations between parameters were found (threshold: |r| > 0.3).
Top-5 Best Results
Parameter Sensitivity Ranking
Parameters ranked by absolute Pearson correlation with each result. Stronger correlations (|r| ≥ 0.7) suggest the parameter has more influence on the outcome.
Convergence Analysis
Parameter statistics
Parameter
Min
Max
Mean
Std Dev
Count
run_time
0
12
5.2174
2.6858
23
status_reason
No numerical statistics available
RESULT
0.7413
1685100328
799288275.5483
735619617.9855
5
program
No numerical statistics available
Show SLURM-Job-ID (if it exists)
Some single-run logs were not shared
By default only logs from failed or interrupted jobs are shared. Successful logs and logs above the upload cap were left out.
single_runs/14065 — successful job (logs are skipped by default)
single_runs/14236 — successful job (logs are skipped by default)
To see these logs here as well, run one of these commands on the machine that has the run folder: