⚠ Raw data does not conform to the expected structure. Expected either a tuple of (mean, SEM) or a float, but got None.
Run-UUID: 9dad4810-49fe-440b-a32e-39507b701429
_________________________________________________
/ \
| OmniOpt2 - Dialing in hyperparameters like a clas |
| sic noir detective. |
\ /
=================================================
\
\
\
\
,.
(_|,.
,' /, )_______ _
__j o``-' `.'-)'
(") \'
`-j |
`-._( /
|_\ |--^. /
/_]'|_| /_)_/
/_]' /_]'
./omniopt --max_nr_of_zero_results 3 --live_share --send_anonymized_usage_stats --partition=alpha --gpus=0 --experiment_name=test_wronggoing_stuff --mem_gb=1 --time=120 --worker_timeout=1 --max_eval=23 --num_parallel_jobs=10 --run_program Li8udGVzdHMvdGVzdF93cm9uZ2dvaW5nX3N0dWZmLmJpbi9iaW4vJShwcm9ncmFtKQ== --parameter program choice divide_by_0,simple_ok,perl,exit_code_137,result_but_exit_code_stdout_stderr,exit_code_stdout,signal_but_has_output,exit_code_no_output,exit_code_stdout_stderr,module_not_found,signal,empty,file_does_not_exist,sleep_10_and_result_exit_252,no_chmod_x,no_shebang,perl_module_fail,segfault,wrong_arch,python_name_error,syntax_error,tensorflow_syntax_error,force_keyboard_interrupt --num_random_steps=1 --follow
Run-folder: /home/runner/work/OmniOpt/OmniOpt/runs/test_wronggoing_stuff/0See https://imageseg.scads.de/omniax/share?user_id=runner&experiment_name=test_wronggoing_stuff&run_nr=34 for live-results.
You have 4 CPUs available for the main process.No CUDA devices found.Generation strategy: SOBOL for 1 step and then BOTORCH_MODULAR for 22 steps.
Run-Program: ./.tests/test_wronggoing_stuff.bin/bin/%(program)
Experiment parameters
┏━━━━━━━━━┳━━━━━━━━┳━━━━━━━━━━━━━━━━━━━━━━━━━━━━━━━━━━━━━━━━━━━━━━━━━━━━━━━━━━━┓
┃Name ┃Type ┃Values ┃
┡━━━━━━━━━╇━━━━━━━━╇━━━━━━━━━━━━━━━━━━━━━━━━━━━━━━━━━━━━━━━━━━━━━━━━━━━━━━━━━━━┩
│program│choice│divide_by_0, simple_ok, perl, exit_code_137, │
│││result_but_exit_code_stdout_stderr, exit_code_stdout, │
│││signal_but_has_output, exit_code_no_output, │
│││exit_code_stdout_stderr, module_not_found, signal, empty,│
│││file_does_not_exist, sleep_10_and_result_exit_252, │
│││no_chmod_x, no_shebang, perl_module_fail, segfault, │
│││wrong_arch, python_name_error, syntax_error, │
│││tensorflow_syntax_error, force_keyboard_interrupt │
└─────────┴────────┴───────────────────────────────────────────────────────────┘
Result-Names
┏━━━━━━━━━━━━━┳━━━━━━━━━━━━━┓
┃Result-Name┃Min or max?┃
┡━━━━━━━━━━━━━╇━━━━━━━━━━━━━┩
│RESULT │ min│
└─────────────┴─────────────┘
╭────────────────OmniOpt evaluation failed - quick diagnosis─────────────────╮│││ Command: ./.tests/test_wronggoing_stuff.bin/bin/module_not_found ││ Working dir: /home/runner/work/OmniOpt/OmniOpt ││ Exit code: 1 ││ Parsed result: {'RESULT': None} ││ Likely cause(s) and how to fix: ││ - The Python module 'THISMODULEDOESNTEXIST' is missing. Install it in ││ the environment used by your program, for example with 'pip install ││ THISMODULEDOESNTEXIST'. ││ - Your program raised a Python exception: ModuleNotFoundError: No module ││ named 'THISMODULEDOESNTEXIST'. Fix the traceback shown above. ││ - Your program produced no stdout. OmniOpt reads results from stdout, so ││ print something like 'RESULT: 1.23'. ││ - Missing numeric result(s) for: RESULT. ││ Relevant output (last lines): ││ Traceback (most recent call last): ││ File ││ "/home/runner/work/OmniOpt/OmniOpt/./.tests/test_wronggoing_stuff.bin/bin/ ││ module_not_found", line 3, in ││ import THISMODULEDOESNTEXIST ││ ModuleNotFoundError: No module named 'THISMODULEDOESNTEXIST' │││╰──────────────────────────────────────────────────────────────────────────────╯
⚠ Raw data does not conform to the expected structure. Expected either a tuple of (mean, SEM) or a float, but got None.╭────────────────OmniOpt evaluation failed - quick diagnosis─────────────────╮│││ Command: ││ ./.tests/test_wronggoing_stuff.bin/bin/sleep_10_and_result_exit_252 ││ Working dir: /home/runner/work/OmniOpt/OmniOpt ││ Exit code: 252 ││ Signal: signal 124 (124) ││ Parsed result: {'RESULT': 1234.0} ││ Likely cause(s) and how to fix: ││ - The process was terminated by signal 124 (124). ││ - Your program produced a valid result but still exited with code 252. ││ OmniOpt may count this evaluation as successful; fix the exit code if that ││ is not intended. ││ Relevant output (last lines): ││ RESULT: 1234 │││╰──────────────────────────────────────────────────────────────────────────────╯╭────────────────OmniOpt evaluation failed - quick diagnosis─────────────────╮│││ Command: ./.tests/test_wronggoing_stuff.bin/bin/divide_by_0 ││ Working dir: /home/runner/work/OmniOpt/OmniOpt ││ Exit code: 255 ││ Signal: signal 127 (127) ││ Parsed result: {'RESULT': None} ││ Likely cause(s) and how to fix: ││ - The process was terminated by signal 127 (127). ││ - Your program produced no stdout. OmniOpt reads results from stdout, so ││ print something like 'RESULT: 1.23'. ││ - Missing numeric result(s) for: RESULT. ││ Relevant output (last lines): ││ Illegal division by zero at ││ ./.tests/test_wronggoing_stuff.bin/bin/divide_by_0 line 3. │││╰──────────────────────────────────────────────────────────────────────────────╯
⚠ Raw data does not conform to the expected structure. Expected either a tuple of (mean, SEM) or a float, but got None.╭────────────────OmniOpt evaluation failed - quick diagnosis─────────────────╮│││ Command: ./.tests/test_wronggoing_stuff.bin/bin/no_shebang ││ Working dir: /home/runner/work/OmniOpt/OmniOpt ││ Exit code: 2 ││ Parsed result: {'RESULT': None} ││ Likely cause(s) and how to fix: ││ - Your program produced no stdout. OmniOpt reads results from stdout, so ││ print something like 'RESULT: 1.23'. ││ - Missing numeric result(s) for: RESULT. ││ - Your program exited with code 2. Check the stderr/traceback above. ││ Relevant output (last lines): ││ import-im6.q16: unable to open X server `' @ ││ error/import.c/ImportImageCommand/346. ││ ./.tests/test_wronggoing_stuff.bin/bin/no_shebang: 2: Syntax error: word ││ unexpected (expecting ")") │││╰──────────────────────────────────────────────────────────────────────────────╯
⚠ Raw data does not conform to the expected structure. Expected either a tuple of (mean, SEM) or a float, but got None.╭────────────────OmniOpt evaluation failed - quick diagnosis─────────────────╮│││ Command: ││ ./.tests/test_wronggoing_stuff.bin/bin/exit_code_stdout_stderr ││ Working dir: /home/runner/work/OmniOpt/OmniOpt ││ Exit code: 5 ││ Parsed result: {'RESULT': None} ││ Likely cause(s) and how to fix: ││ - OmniOpt found no result in stdout. Expected RESULT: . Make ││ sure your program prints the result to stdout. ││ - Missing numeric result(s) for: RESULT. ││ - Your program exited with code 5. Check the stderr/traceback above. ││ Relevant output (last lines): ││ This has stderr │││╰──────────────────────────────────────────────────────────────────────────────╯
⚠ Raw data does not conform to the expected structure. Expected either a tuple of (mean, SEM) or a float, but got None.╭────────────────OmniOpt evaluation failed - quick diagnosis─────────────────╮│││ Command: ││ ./.tests/test_wronggoing_stuff.bin/bin/signal_but_has_output ││ Working dir: /home/runner/work/OmniOpt/OmniOpt ││ Exit code: 137 ││ Signal: SIGKILL (9) ││ Parsed result: {'RESULT': None} ││ Likely cause(s) and how to fix: ││ - The process was killed by SIGKILL. This is often the OOM killer. Try ││ more memory (--mem_gb, currently 1 GB) or reduce the memory usage of your ││ program. ││ - Your program produced no stdout. OmniOpt reads results from stdout, so ││ print something like 'RESULT: 1.23'. ││ - Missing numeric result(s) for: RESULT. ││ Relevant output (last lines): ││ Killed ││ Killed │││╰──────────────────────────────────────────────────────────────────────────────╯
⚠ Raw data does not conform to the expected structure. Expected either a tuple of (mean, SEM) or a float, but got None.╭────────────────OmniOpt evaluation failed - quick diagnosis─────────────────╮│││ Command: ./.tests/test_wronggoing_stuff.bin/bin/wrong_arch ││ Working dir: /home/runner/work/OmniOpt/OmniOpt ││ Exit code: 126 ││ Parsed result: {'RESULT': None} ││ Likely cause(s) and how to fix: ││ - Your program produced no stdout. OmniOpt reads results from stdout, so ││ print something like 'RESULT: 1.23'. ││ - Missing numeric result(s) for: RESULT. ││ - Your program exited with code 126 (Command Invoked Cannot Execute - ││ Permission problem or command is not an executable or it was compiled for ││ a different platform). Check the stderr/traceback above. ││ Relevant output (last lines): ││ /bin/sh: 1: ./.tests/test_wronggoing_stuff.bin/bin/wrong_arch: Exec ││ format error │││╰──────────────────────────────────────────────────────────────────────────────╯
⚠ Raw data does not conform to the expected structure. Expected either a tuple of (mean, SEM) or a float, but got None.╭────────────────OmniOpt evaluation failed - quick diagnosis─────────────────╮│││ Command: ./.tests/test_wronggoing_stuff.bin/bin/exit_code_no_output ││ Working dir: /home/runner/work/OmniOpt/OmniOpt ││ Exit code: 5 ││ Parsed result: {'RESULT': None} ││ Likely cause(s) and how to fix: ││ - Your program produced no stdout. OmniOpt reads results from stdout, so ││ print something like 'RESULT: 1.23'. ││ - Missing numeric result(s) for: RESULT. ││ - Your program exited with code 5. Check the stderr/traceback above. │││╰──────────────────────────────────────────────────────────────────────────────╯
⚠ Raw data does not conform to the expected structure. Expected either a tuple of (mean, SEM) or a float, but got None.╭────────────────OmniOpt evaluation failed - quick diagnosis─────────────────╮│││ Command: ./.tests/test_wronggoing_stuff.bin/bin/exit_code_137 ││ Working dir: /home/runner/work/OmniOpt/OmniOpt ││ Exit code: 137 ││ Signal: SIGKILL (9) ││ Parsed result: {'RESULT': None} ││ Likely cause(s) and how to fix: ││ - The process was killed by SIGKILL. This is often the OOM killer. Try ││ more memory (--mem_gb, currently 1 GB) or reduce the memory usage of your ││ program. ││ - Your program produced no stdout. OmniOpt reads results from stdout, so ││ print something like 'RESULT: 1.23'. ││ - Missing numeric result(s) for: RESULT. │││╰──────────────────────────────────────────────────────────────────────────────╯
⚠ Raw data does not conform to the expected structure. Expected either a tuple of (mean, SEM) or a float, but got None.╭────────────────OmniOpt evaluation failed - quick diagnosis─────────────────╮│││ Command: ./.tests/test_wronggoing_stuff.bin/bin/empty ││ Working dir: /home/runner/work/OmniOpt/OmniOpt ││ Exit code: 126 ││ Parsed result: {'RESULT': None} ││ Likely cause(s) and how to fix: ││ - A file or command was not executable. Run 'chmod +x ' or ││ invoke the script explicitly with 'bash ' / 'python3 '. ││ - Your program produced no stdout. OmniOpt reads results from stdout, so ││ print something like 'RESULT: 1.23'. ││ - Missing numeric result(s) for: RESULT. ││ Relevant output (last lines): ││ /bin/sh: 1: ./.tests/test_wronggoing_stuff.bin/bin/empty: Permission ││ denied │││╰──────────────────────────────────────────────────────────────────────────────╯
⚠ Raw data does not conform to the expected structure. Expected either a tuple of (mean, SEM) or a float, but got None.╭────────────────OmniOpt evaluation failed - quick diagnosis─────────────────╮│││ Command: ./.tests/test_wronggoing_stuff.bin/bin/exit_code_stdout ││ Working dir: /home/runner/work/OmniOpt/OmniOpt ││ Exit code: 5 ││ Parsed result: {'RESULT': 1525120974.0} ││ Likely cause(s) and how to fix: ││ - Your program produced a valid result but still exited with code 5. ││ OmniOpt may count this evaluation as successful; fix the exit code if that ││ is not intended. ││ Relevant output (last lines): ││ STDERR │││╰──────────────────────────────────────────────────────────────────────────────╯╭────────────────OmniOpt evaluation failed - quick diagnosis─────────────────╮│││ Command: ││ ./.tests/test_wronggoing_stuff.bin/bin/result_but_exit_code_stdout_stderr ││ Working dir: /home/runner/work/OmniOpt/OmniOpt ││ Exit code: 5 ││ Parsed result: {'RESULT': 1614828690.0} ││ Likely cause(s) and how to fix: ││ - Your program produced a valid result but still exited with code 5. ││ OmniOpt may count this evaluation as successful; fix the exit code if that ││ is not intended. ││ Relevant output (last lines): ││ stderr │││╰──────────────────────────────────────────────────────────────────────────────╯╭────────────────OmniOpt evaluation failed - quick diagnosis─────────────────╮│││ Command: ./.tests/test_wronggoing_stuff.bin/bin/file_does_not_exist ││ Working dir: /home/runner/work/OmniOpt/OmniOpt ││ Exit code: 127 ││ Parsed result: {'RESULT': None} ││ Likely cause(s) and how to fix: ││ - The command ││ './.tests/test_wronggoing_stuff.bin/bin/file_does_not_exist' was not ││ found. Check the spelling, your PATH and whether the program is installed ││ in the environment used by OmniOpt. ││ - Your program produced no stdout. OmniOpt reads results from stdout, so ││ print something like 'RESULT: 1.23'. ││ - Missing numeric result(s) for: RESULT. ││ Relevant output (last lines): ││ /bin/sh: 1: ./.tests/test_wronggoing_stuff.bin/bin/file_does_not_exist: ││ not found │││╰──────────────────────────────────────────────────────────────────────────────╯
⚠ Raw data does not conform to the expected structure. Expected either a tuple of (mean, SEM) or a float, but got None.╭────────────────OmniOpt evaluation failed - quick diagnosis─────────────────╮│││ Command: ./.tests/test_wronggoing_stuff.bin/bin/perl_module_fail ││ Working dir: /home/runner/work/OmniOpt/OmniOpt ││ Exit code: 2 ││ Parsed result: {'RESULT': None} ││ Likely cause(s) and how to fix: ││ - Your program produced no stdout. OmniOpt reads results from stdout, so ││ print something like 'RESULT: 1.23'. ││ - Missing numeric result(s) for: RESULT. ││ - Your program exited with code 2. Check the stderr/traceback above. ││ Relevant output (last lines): ││ Can't locate INeverExisted.pm in @INC (you may need to install the ││ INeverExisted module) (@INC contains: /etc/perl ││ /usr/local/lib/x86_64-linux-gnu/perl/5.34.0 /usr/local/share/perl/5.34.0 ││ /usr/lib/x86_64-linux-gnu/perl5/5.34 /usr/share/p... ││ BEGIN failed--compilation aborted at ││ ./.tests/test_wronggoing_stuff.bin/bin/perl_module_fail line 3. │││╰──────────────────────────────────────────────────────────────────────────────╯
⚠ Raw data does not conform to the expected structure. Expected either a tuple of (mean, SEM) or a float, but got None.╭────────────────OmniOpt evaluation failed - quick diagnosis─────────────────╮│││ Command: ./.tests/test_wronggoing_stuff.bin/bin/segfault ││ Working dir: /home/runner/work/OmniOpt/OmniOpt ││ Exit code: 139 ││ Signal: SIGSEGV (11) ││ Parsed result: {'RESULT': None} ││ Likely cause(s) and how to fix: ││ - The process crashed with SIGSEGV (segmentation fault). This usually ││ comes from native code, a broken C extension, CUDA/driver issues or ││ invalid memory access. ││ - Your program produced no stdout. OmniOpt reads results from stdout, so ││ print something like 'RESULT: 1.23'. ││ - Missing numeric result(s) for: RESULT. ││ Relevant output (last lines): ││ Segmentation fault (core dumped) │││╰──────────────────────────────────────────────────────────────────────────────╯
⚠ Raw data does not conform to the expected structure. Expected either a tuple of (mean, SEM) or a float, but got None.╭────────────────OmniOpt evaluation failed - quick diagnosis─────────────────╮│││ Command: ./.tests/test_wronggoing_stuff.bin/bin/python_name_error ││ Working dir: /home/runner/work/OmniOpt/OmniOpt ││ Exit code: 1 ││ Parsed result: {'RESULT': None} ││ Likely cause(s) and how to fix: ││ - Your program raised a Python exception: NameError: name 'askldasdasd' ││ is not defined. Fix the traceback shown above. ││ - Your program produced no stdout. OmniOpt reads results from stdout, so ││ print something like 'RESULT: 1.23'. ││ - Missing numeric result(s) for: RESULT. ││ Relevant output (last lines): ││ Traceback (most recent call last): ││ File ││ "/home/runner/work/OmniOpt/OmniOpt/./.tests/test_wronggoing_stuff.bin/bin/ ││ python_name_error", line 2, in ││ askldasdasd ││ NameError: name 'askldasdasd' is not defined │││╰──────────────────────────────────────────────────────────────────────────────╯
⚠ Raw data does not conform to the expected structure. Expected either a tuple of (mean, SEM) or a float, but got None.╭────────────────OmniOpt evaluation failed - quick diagnosis─────────────────╮│││ Command: ./.tests/test_wronggoing_stuff.bin/bin/syntax_error ││ Working dir: /home/runner/work/OmniOpt/OmniOpt ││ Exit code: 1 ││ Parsed result: {'RESULT': None} ││ Likely cause(s) and how to fix: ││ - Your program produced no stdout. OmniOpt reads results from stdout, so ││ print something like 'RESULT: 1.23'. ││ - Missing numeric result(s) for: RESULT. ││ - Your program exited with code 1. Check the stderr/traceback above. ││ Relevant output (last lines): ││ File ││ "/home/runner/work/OmniOpt/OmniOpt/./.tests/test_wronggoing_stuff.bin/bin/ ││ syntax_error", line 3 ││ def x () {} ││ ^ ││ SyntaxError: expected ':' │││╰──────────────────────────────────────────────────────────────────────────────╯
⚠ Raw data does not conform to the expected structure. Expected either a tuple of (mean, SEM) or a float, but got None.╭────────────────OmniOpt evaluation failed - quick diagnosis─────────────────╮│││ Command: ││ ./.tests/test_wronggoing_stuff.bin/bin/tensorflow_syntax_error ││ Working dir: /home/runner/work/OmniOpt/OmniOpt ││ Exit code: 1 ││ Parsed result: {'RESULT': None} ││ Likely cause(s) and how to fix: ││ - The Python module 'tensorflow' is missing. Install it in the ││ environment used by your program, for example with 'pip install ││ tensorflow'. ││ - Your program raised a Python exception: ModuleNotFoundError: No module ││ named 'tensorflow'. Fix the traceback shown above. ││ - Your program produced no stdout. OmniOpt reads results from stdout, so ││ print something like 'RESULT: 1.23'. ││ - Missing numeric result(s) for: RESULT. ││ Relevant output (last lines): ││ Traceback (most recent call last): ││ File ││ "/home/runner/work/OmniOpt/OmniOpt/./.tests/test_wronggoing_stuff.bin/bin/ ││ tensorflow_syntax_error", line 3, in ││ import tensorflow as tf ││ ModuleNotFoundError: No module named 'tensorflow' │││╰──────────────────────────────────────────────────────────────────────────────╯
⚠ Raw data does not conform to the expected structure. Expected either a tuple of (mean, SEM) or a float, but got None.╭────────────────OmniOpt evaluation failed - quick diagnosis─────────────────╮│││ Command: ││ ./.tests/test_wronggoing_stuff.bin/bin/force_keyboard_interrupt ││ Working dir: /home/runner/work/OmniOpt/OmniOpt ││ Exit code: 130 ││ Signal: SIGINT (2) ││ Parsed result: {'RESULT': None} ││ Likely cause(s) and how to fix: ││ - The process was terminated by SIGINT (2). ││ - Your program raised a Python exception: KeyboardInterrupt: Test error. ││ Fix the traceback shown above. ││ - Your program produced no stdout. OmniOpt reads results from stdout, so ││ print something like 'RESULT: 1.23'. ││ - Missing numeric result(s) for: RESULT. ││ Relevant output (last lines): ││ Traceback (most recent call last): ││ File ││ "/home/runner/work/OmniOpt/OmniOpt/./.tests/test_wronggoing_stuff.bin/bin/ ││ force_keyboard_interrupt", line 3, in ││ raise KeyboardInterrupt("Test error") ││ KeyboardInterrupt: Test error │││╰──────────────────────────────────────────────────────────────────────────────╯
⚠ Raw data does not conform to the expected structure. Expected either a tuple of (mean, SEM) or a float, but got None.╭────────────────OmniOpt evaluation failed - quick diagnosis─────────────────╮│││ Command: ./.tests/test_wronggoing_stuff.bin/bin/signal ││ Working dir: /home/runner/work/OmniOpt/OmniOpt ││ Exit code: 137 ││ Signal: SIGKILL (9) ││ Parsed result: {'RESULT': None} ││ Likely cause(s) and how to fix: ││ - The process was killed by SIGKILL. This is often the OOM killer. Try ││ more memory (--mem_gb, currently 1 GB) or reduce the memory usage of your ││ program. ││ - Your program produced no stdout. OmniOpt reads results from stdout, so ││ print something like 'RESULT: 1.23'. ││ - Missing numeric result(s) for: RESULT. ││ Relevant output (last lines): ││ Killed ││ Killed │││╰──────────────────────────────────────────────────────────────────────────────╯
⚠ Raw data does not conform to the expected structure. Expected either a tuple of (mean, SEM) or a float, but got None.╭────────────────OmniOpt evaluation failed - quick diagnosis─────────────────╮│││ Command: ./.tests/test_wronggoing_stuff.bin/bin/no_chmod_x ││ Working dir: /home/runner/work/OmniOpt/OmniOpt ││ Exit code: 126 ││ Parsed result: {'RESULT': None} ││ Likely cause(s) and how to fix: ││ - A file or command was not executable. Run 'chmod +x ' or ││ invoke the script explicitly with 'bash ' / 'python3 '. ││ - Your program produced no stdout. OmniOpt reads results from stdout, so ││ print something like 'RESULT: 1.23'. ││ - Missing numeric result(s) for: RESULT. ││ Relevant output (last lines): ││ /bin/sh: 1: ./.tests/test_wronggoing_stuff.bin/bin/no_chmod_x: ││ Permission denied │││╰──────────────────────────────────────────────────────────────────────────────╯
⚠ Raw data does not conform to the expected structure. Expected either a tuple of (mean, SEM) or a float, but got None.[omniopt] Only 0/1 unique points could be generated (retries=20/20, node=BOTORCH_MODULAR, duplicates=20, constraints=0, empty_batches=0). Details: /home/runner/work/OmniOpt/OmniOpt/runs/test_wronggoing_stuff/0/generation_debug.csv[omniopt] Only 0/1 unique points could be generated (retries=20/20, node=BOTORCH_MODULAR, duplicates=20, constraints=0, empty_batches=0). Details: /home/runner/work/OmniOpt/OmniOpt/runs/test_wronggoing_stuff/0/generation_debug.csv[omniopt] Only 0/1 unique points could be generated (retries=20/20, node=BOTORCH_MODULAR, duplicates=20, constraints=0, empty_batches=0). Details: /home/runner/work/OmniOpt/OmniOpt/runs/test_wronggoing_stuff/0/generation_debug.csv[omniopt] Only 0/1 unique points could be generated (retries=20/20, node=BOTORCH_MODULAR, duplicates=20, constraints=0, empty_batches=0). Details: /home/runner/work/OmniOpt/OmniOpt/runs/test_wronggoing_stuff/0/generation_debug.csv[omniopt] Only 0/1 unique points could be generated (retries=20/20, node=BOTORCH_MODULAR, duplicates=20, constraints=0, empty_batches=0). Details: /home/runner/work/OmniOpt/OmniOpt/runs/test_wronggoing_stuff/0/generation_debug.csv[omniopt] Only 0/1 unique points could be generated (retries=20/20, node=BOTORCH_MODULAR, duplicates=20, constraints=0, empty_batches=0). Details: /home/runner/work/OmniOpt/OmniOpt/runs/test_wronggoing_stuff/0/generation_debug.csv[omniopt] Only 0/1 unique points could be generated (retries=20/20, node=BOTORCH_MODULAR, duplicates=20, constraints=0, empty_batches=0). Details: /home/runner/work/OmniOpt/OmniOpt/runs/test_wronggoing_stuff/0/generation_debug.csvFailed Jobs parameters
┏━━━━━━━━┳━━━━━━━━┳━━━━━━━━┳━━━━━━━━━━━━━━━━━━━━━━━━━━━━━━━━━━━━━━━━━━━━━━━━━━━┓
┃param1┃param2┃param3┃error_description ┃
┡━━━━━━━━╇━━━━━━━━╇━━━━━━━━╇━━━━━━━━━━━━━━━━━━━━━━━━━━━━━━━━━━━━━━━━━━━━━━━━━━━┩
│value1│value2│value3│Some error occurred during execution (this is not│
││││a real error!). │
└────────┴────────┴────────┴───────────────────────────────────────────────────┘
Best RESULT, min (total: 5, failed: 18)
┏━━━━━━━━━┳━━━━━━━━━━━━━━┓
┃program┃RESULT ┃
┡━━━━━━━━━╇━━━━━━━━━━━━━━┩
│perl │0.1433639809│
└─────────┴──────────────┘
Not printing sixel graphics in CI
Runtime Infos
┏━━━━━━━━━━━━━━━━━━━━━━━┳━━━━━━━━━━━┳━━━━━━━━━━━━┳━━━━━━━━━━━━━━┳━━━━━━━━━━━━━┓
┃Number of evaluations┃Min time ┃ Max time ┃Average time┃Median time┃
┡━━━━━━━━━━━━━━━━━━━━━━━╇━━━━━━━━━━━╇━━━━━━━━━━━━╇━━━━━━━━━━━━━━╇━━━━━━━━━━━━━┩
│ 23 │ 6.00 sec │ 12.00 sec │ 6.26 sec │ 6.00 sec │
└───────────────────────┴───────────┴────────────┴──────────────┴─────────────┘
╭────────────────────────────OmniOpt2 Run Summary────────────────────────────╮│││ ⚠️ Optimization finished with some failures││││ 📊 Trials: 5 succeeded / 18 failed / 5 done / 23 submitted ││ ⏱️ Duration: 338s (5m38s) ││ 🏆 Best RESULT: 0.1433639809 ││ 📁 Results: /home/runner/work/OmniOpt/OmniOpt/runs/test_wronggoing_stuff││ 🤖 Model: BOTORCH_MODULAR │││╰──────────────────────────────────────────────────────────────────────────────╯
2026-11-01 09:58:31 (d2beaf7a-3791-43a5-ad10-a3cb7cb1cfcf): SOBOL, Started OmniOpt2 run...
2026-11-01 09:58:31 (d2beaf7a-3791-43a5-ad10-a3cb7cb1cfcf): SOBOL, getting new HP set (no sbatch)
2026-11-01 09:58:31 (d2beaf7a-3791-43a5-ad10-a3cb7cb1cfcf): SOBOL, requested 1 jobs, got 1, 0.03 s/job
2026-11-01 09:58:31 (d2beaf7a-3791-43a5-ad10-a3cb7cb1cfcf): SOBOL, eval #1/1 start
2026-11-01 09:58:31 (d2beaf7a-3791-43a5-ad10-a3cb7cb1cfcf): SOBOL, starting new job
2026-11-01 09:58:31 (d2beaf7a-3791-43a5-ad10-a3cb7cb1cfcf): SOBOL, started new job
2026-11-01 09:58:40 (d2beaf7a-3791-43a5-ad10-a3cb7cb1cfcf): SOBOL, job_failed
2026-11-01 09:58:40 (d2beaf7a-3791-43a5-ad10-a3cb7cb1cfcf): SOBOL, failed: 1 ('RESULT: <FLOAT>' not found), finishing jobs (get_next_trials), finished 1 job
2026-11-01 09:58:40 (d2beaf7a-3791-43a5-ad10-a3cb7cb1cfcf): SOBOL, failed: 1 ('RESULT: <FLOAT>' not found), getting new HP set (no sbatch)
2026-11-01 09:58:40 (d2beaf7a-3791-43a5-ad10-a3cb7cb1cfcf): SOBOL, failed: 1 ('RESULT: <FLOAT>' not found), requested 1 jobs, got 1, 0.04 s/job
2026-11-01 09:58:40 (d2beaf7a-3791-43a5-ad10-a3cb7cb1cfcf): SOBOL, failed: 1 ('RESULT: <FLOAT>' not found), eval #1/1 start
2026-11-01 09:58:40 (d2beaf7a-3791-43a5-ad10-a3cb7cb1cfcf): SOBOL, failed: 1 ('RESULT: <FLOAT>' not found), starting new job
2026-11-01 09:58:40 (d2beaf7a-3791-43a5-ad10-a3cb7cb1cfcf): SOBOL, failed: 1 ('RESULT: <FLOAT>' not found), started new job
2026-11-01 09:58:56 (d2beaf7a-3791-43a5-ad10-a3cb7cb1cfcf): SOBOL, failed: 1 ('RESULT: <FLOAT>' not found), new result: RESULT: 1234.000000
2026-11-01 09:58:57 (d2beaf7a-3791-43a5-ad10-a3cb7cb1cfcf): SOBOL, failed: 1 ('RESULT: <FLOAT>' not found), best RESULT: 1234, finishing jobs (get_next_trials), finished 1 job
2026-11-01 09:58:57 (d2beaf7a-3791-43a5-ad10-a3cb7cb1cfcf): BOTORCH_MODULAR, failed: 1 ('RESULT: <FLOAT>' not found), best RESULT: 1234, getting new HP set (no sbatch)
2026-11-01 09:58:57 (d2beaf7a-3791-43a5-ad10-a3cb7cb1cfcf): BOTORCH_MODULAR, failed: 1 ('RESULT: <FLOAT>' not found), best RESULT: 1234, requested 1 jobs, got 1, 0.31 s/job
2026-11-01 09:58:57 (d2beaf7a-3791-43a5-ad10-a3cb7cb1cfcf): BOTORCH_MODULAR, failed: 1 ('RESULT: <FLOAT>' not found), best RESULT: 1234, eval #1/1 start
2026-11-01 09:58:57 (d2beaf7a-3791-43a5-ad10-a3cb7cb1cfcf): BOTORCH_MODULAR, failed: 1 ('RESULT: <FLOAT>' not found), best RESULT: 1234, starting new job
2026-11-01 09:58:57 (d2beaf7a-3791-43a5-ad10-a3cb7cb1cfcf): BOTORCH_MODULAR, failed: 1 ('RESULT: <FLOAT>' not found), best RESULT: 1234, started new job
2026-11-01 09:59:06 (d2beaf7a-3791-43a5-ad10-a3cb7cb1cfcf): BOTORCH_MODULAR, failed: 1 ('RESULT: <FLOAT>' not found), best RESULT: 1234, job_failed
2026-11-01 09:59:06 (d2beaf7a-3791-43a5-ad10-a3cb7cb1cfcf): BOTORCH_MODULAR, failed: 2 ('RESULT: <FLOAT>' not found), best RESULT: 1234, finishing jobs (get_next_trials), finished 1 job
2026-11-01 09:59:07 (d2beaf7a-3791-43a5-ad10-a3cb7cb1cfcf): BOTORCH_MODULAR, failed: 2 ('RESULT: <FLOAT>' not found), best RESULT: 1234, getting new HP set (no sbatch)
2026-11-01 09:59:07 (d2beaf7a-3791-43a5-ad10-a3cb7cb1cfcf): BOTORCH_MODULAR, failed: 2 ('RESULT: <FLOAT>' not found), best RESULT: 1234, requested 1 jobs, got 1, 0.54 s/job
2026-11-01 09:59:07 (d2beaf7a-3791-43a5-ad10-a3cb7cb1cfcf): BOTORCH_MODULAR, failed: 2 ('RESULT: <FLOAT>' not found), best RESULT: 1234, eval #1/1 start
2026-11-01 09:59:07 (d2beaf7a-3791-43a5-ad10-a3cb7cb1cfcf): BOTORCH_MODULAR, failed: 2 ('RESULT: <FLOAT>' not found), best RESULT: 1234, starting new job
2026-11-01 09:59:07 (d2beaf7a-3791-43a5-ad10-a3cb7cb1cfcf): BOTORCH_MODULAR, failed: 2 ('RESULT: <FLOAT>' not found), best RESULT: 1234, started new job
2026-11-01 09:59:16 (d2beaf7a-3791-43a5-ad10-a3cb7cb1cfcf): BOTORCH_MODULAR, failed: 2 ('RESULT: <FLOAT>' not found), best RESULT: 1234, job_failed
2026-11-01 09:59:16 (d2beaf7a-3791-43a5-ad10-a3cb7cb1cfcf): BOTORCH_MODULAR, failed: 3 ('RESULT: <FLOAT>' not found), best RESULT: 1234, finishing jobs (get_next_trials), finished 1 job
2026-11-01 09:59:16 (d2beaf7a-3791-43a5-ad10-a3cb7cb1cfcf): BOTORCH_MODULAR, failed: 3 ('RESULT: <FLOAT>' not found), best RESULT: 1234, getting new HP set (no sbatch)
2026-11-01 09:59:16 (d2beaf7a-3791-43a5-ad10-a3cb7cb1cfcf): BOTORCH_MODULAR, failed: 3 ('RESULT: <FLOAT>' not found), best RESULT: 1234, requested 1 jobs, got 1, 0.32 s/job
2026-11-01 09:59:16 (d2beaf7a-3791-43a5-ad10-a3cb7cb1cfcf): BOTORCH_MODULAR, failed: 3 ('RESULT: <FLOAT>' not found), best RESULT: 1234, eval #1/1 start
2026-11-01 09:59:16 (d2beaf7a-3791-43a5-ad10-a3cb7cb1cfcf): BOTORCH_MODULAR, failed: 3 ('RESULT: <FLOAT>' not found), best RESULT: 1234, starting new job
2026-11-01 09:59:17 (d2beaf7a-3791-43a5-ad10-a3cb7cb1cfcf): BOTORCH_MODULAR, failed: 3 ('RESULT: <FLOAT>' not found), best RESULT: 1234, started new job
2026-11-01 09:59:26 (d2beaf7a-3791-43a5-ad10-a3cb7cb1cfcf): BOTORCH_MODULAR, failed: 3 ('RESULT: <FLOAT>' not found), best RESULT: 1234, job_failed
2026-11-01 09:59:26 (d2beaf7a-3791-43a5-ad10-a3cb7cb1cfcf): BOTORCH_MODULAR, failed: 4 ('RESULT: <FLOAT>' not found), best RESULT: 1234, finishing jobs (get_next_trials), finished 1 job
2026-11-01 09:59:26 (d2beaf7a-3791-43a5-ad10-a3cb7cb1cfcf): BOTORCH_MODULAR, failed: 4 ('RESULT: <FLOAT>' not found), best RESULT: 1234, getting new HP set (no sbatch)
2026-11-01 09:59:26 (d2beaf7a-3791-43a5-ad10-a3cb7cb1cfcf): BOTORCH_MODULAR, failed: 4 ('RESULT: <FLOAT>' not found), best RESULT: 1234, requested 1 jobs, got 1, 0.33 s/job
2026-11-01 09:59:26 (d2beaf7a-3791-43a5-ad10-a3cb7cb1cfcf): BOTORCH_MODULAR, failed: 4 ('RESULT: <FLOAT>' not found), best RESULT: 1234, eval #1/1 start
2026-11-01 09:59:26 (d2beaf7a-3791-43a5-ad10-a3cb7cb1cfcf): BOTORCH_MODULAR, failed: 4 ('RESULT: <FLOAT>' not found), best RESULT: 1234, starting new job
2026-11-01 09:59:26 (d2beaf7a-3791-43a5-ad10-a3cb7cb1cfcf): BOTORCH_MODULAR, failed: 4 ('RESULT: <FLOAT>' not found), best RESULT: 1234, started new job
2026-11-01 09:59:35 (d2beaf7a-3791-43a5-ad10-a3cb7cb1cfcf): BOTORCH_MODULAR, failed: 4 ('RESULT: <FLOAT>' not found), best RESULT: 1234, new result: RESULT: 0.143364
2026-11-01 09:59:37 (d2beaf7a-3791-43a5-ad10-a3cb7cb1cfcf): BOTORCH_MODULAR, failed: 4 ('RESULT: <FLOAT>' not found), best RESULT: 0.143363980882899, ▁█, finishing jobs (get_next_trials), finished 1 job
2026-11-01 09:59:38 (d2beaf7a-3791-43a5-ad10-a3cb7cb1cfcf): BOTORCH_MODULAR, failed: 4 ('RESULT: <FLOAT>' not found), best RESULT: 0.143363980882899, ▁█, getting new HP set (no sbatch)
2026-11-01 09:59:38 (d2beaf7a-3791-43a5-ad10-a3cb7cb1cfcf): BOTORCH_MODULAR, failed: 4 ('RESULT: <FLOAT>' not found), best RESULT: 0.143363980882899, ▁█, requested 1 jobs, got 1, 1.30 s/job
2026-11-01 09:59:38 (d2beaf7a-3791-43a5-ad10-a3cb7cb1cfcf): BOTORCH_MODULAR, failed: 4 ('RESULT: <FLOAT>' not found), best RESULT: 0.143363980882899, ▁█, eval #1/1 start
2026-11-01 09:59:38 (d2beaf7a-3791-43a5-ad10-a3cb7cb1cfcf): BOTORCH_MODULAR, failed: 4 ('RESULT: <FLOAT>' not found), best RESULT: 0.143363980882899, ▁█, starting new job
2026-11-01 09:59:39 (d2beaf7a-3791-43a5-ad10-a3cb7cb1cfcf): BOTORCH_MODULAR, failed: 4 ('RESULT: <FLOAT>' not found), best RESULT: 0.143363980882899, ▁█, started new job
2026-11-01 09:59:48 (d2beaf7a-3791-43a5-ad10-a3cb7cb1cfcf): BOTORCH_MODULAR, failed: 4 ('RESULT: <FLOAT>' not found), best RESULT: 0.143363980882899, ▁█, job_failed
2026-11-01 09:59:48 (d2beaf7a-3791-43a5-ad10-a3cb7cb1cfcf): BOTORCH_MODULAR, failed: 5 ('RESULT: <FLOAT>' not found), best RESULT: 0.1433639809, ▁█, finishing jobs (get_next_trials), finished 1 job
2026-11-01 09:59:49 (d2beaf7a-3791-43a5-ad10-a3cb7cb1cfcf): BOTORCH_MODULAR, failed: 5 ('RESULT: <FLOAT>' not found), best RESULT: 0.1433639809, ▁█, getting new HP set (no sbatch)
2026-11-01 09:59:49 (d2beaf7a-3791-43a5-ad10-a3cb7cb1cfcf): BOTORCH_MODULAR, failed: 5 ('RESULT: <FLOAT>' not found), best RESULT: 0.1433639809, ▁█, requested 1 jobs, got 1, 1.26 s/job
2026-11-01 09:59:49 (d2beaf7a-3791-43a5-ad10-a3cb7cb1cfcf): BOTORCH_MODULAR, failed: 5 ('RESULT: <FLOAT>' not found), best RESULT: 0.1433639809, ▁█, eval #1/1 start
2026-11-01 09:59:49 (d2beaf7a-3791-43a5-ad10-a3cb7cb1cfcf): BOTORCH_MODULAR, failed: 5 ('RESULT: <FLOAT>' not found), best RESULT: 0.1433639809, ▁█, starting new job
2026-11-01 09:59:49 (d2beaf7a-3791-43a5-ad10-a3cb7cb1cfcf): BOTORCH_MODULAR, failed: 5 ('RESULT: <FLOAT>' not found), best RESULT: 0.1433639809, ▁█, started new job
2026-11-01 09:59:58 (d2beaf7a-3791-43a5-ad10-a3cb7cb1cfcf): BOTORCH_MODULAR, failed: 5 ('RESULT: <FLOAT>' not found), best RESULT: 0.1433639809, ▁█, job_failed
2026-11-01 09:59:58 (d2beaf7a-3791-43a5-ad10-a3cb7cb1cfcf): BOTORCH_MODULAR, failed: 6 ('RESULT: <FLOAT>' not found), best RESULT: 0.1433639809, ▁█, finishing jobs (get_next_trials), finished 1 job
2026-11-01 09:59:59 (d2beaf7a-3791-43a5-ad10-a3cb7cb1cfcf): BOTORCH_MODULAR, failed: 6 ('RESULT: <FLOAT>' not found), best RESULT: 0.1433639809, ▁█, getting new HP set (no sbatch)
2026-11-01 10:00:00 (d2beaf7a-3791-43a5-ad10-a3cb7cb1cfcf): BOTORCH_MODULAR, failed: 6 ('RESULT: <FLOAT>' not found), best RESULT: 0.1433639809, ▁█, requested 1 jobs, got 1, 1.26 s/job
2026-11-01 10:00:00 (d2beaf7a-3791-43a5-ad10-a3cb7cb1cfcf): BOTORCH_MODULAR, failed: 6 ('RESULT: <FLOAT>' not found), best RESULT: 0.1433639809, ▁█, eval #1/1 start
2026-11-01 10:00:00 (d2beaf7a-3791-43a5-ad10-a3cb7cb1cfcf): BOTORCH_MODULAR, failed: 6 ('RESULT: <FLOAT>' not found), best RESULT: 0.1433639809, ▁█, starting new job
2026-11-01 10:00:00 (d2beaf7a-3791-43a5-ad10-a3cb7cb1cfcf): BOTORCH_MODULAR, failed: 6 ('RESULT: <FLOAT>' not found), best RESULT: 0.1433639809, ▁█, started new job
2026-11-01 10:00:09 (d2beaf7a-3791-43a5-ad10-a3cb7cb1cfcf): BOTORCH_MODULAR, failed: 6 ('RESULT: <FLOAT>' not found), best RESULT: 0.1433639809, ▁█, job_failed
2026-11-01 10:00:09 (d2beaf7a-3791-43a5-ad10-a3cb7cb1cfcf): BOTORCH_MODULAR, failed: 7 ('RESULT: <FLOAT>' not found), best RESULT: 0.1433639809, ▁█, finishing jobs (get_next_trials), finished 1 job
2026-11-01 10:00:10 (d2beaf7a-3791-43a5-ad10-a3cb7cb1cfcf): BOTORCH_MODULAR, failed: 7 ('RESULT: <FLOAT>' not found), best RESULT: 0.1433639809, ▁█, getting new HP set (no sbatch)
2026-11-01 10:00:10 (d2beaf7a-3791-43a5-ad10-a3cb7cb1cfcf): BOTORCH_MODULAR, failed: 7 ('RESULT: <FLOAT>' not found), best RESULT: 0.1433639809, ▁█, requested 1 jobs, got 1, 1.24 s/job
2026-11-01 10:00:10 (d2beaf7a-3791-43a5-ad10-a3cb7cb1cfcf): BOTORCH_MODULAR, failed: 7 ('RESULT: <FLOAT>' not found), best RESULT: 0.1433639809, ▁█, eval #1/1 start
2026-11-01 10:00:10 (d2beaf7a-3791-43a5-ad10-a3cb7cb1cfcf): BOTORCH_MODULAR, failed: 7 ('RESULT: <FLOAT>' not found), best RESULT: 0.1433639809, ▁█, starting new job
2026-11-01 10:00:10 (d2beaf7a-3791-43a5-ad10-a3cb7cb1cfcf): BOTORCH_MODULAR, failed: 7 ('RESULT: <FLOAT>' not found), best RESULT: 0.1433639809, ▁█, started new job
2026-11-01 10:00:19 (d2beaf7a-3791-43a5-ad10-a3cb7cb1cfcf): BOTORCH_MODULAR, failed: 7 ('RESULT: <FLOAT>' not found), best RESULT: 0.1433639809, ▁█, new result: RESULT: 4991360.000000
2026-11-01 10:00:21 (d2beaf7a-3791-43a5-ad10-a3cb7cb1cfcf): BOTORCH_MODULAR, failed: 7 ('RESULT: <FLOAT>' not found), best RESULT: 0.1433639809, ▇█▁, finishing jobs, finished 1 job
2026-11-01 10:00:22 (d2beaf7a-3791-43a5-ad10-a3cb7cb1cfcf): BOTORCH_MODULAR, failed: 7 ('RESULT: <FLOAT>' not found), best RESULT: 0.1433639809, ▇█▁, getting new HP set (no sbatch)
2026-11-01 10:00:24 (d2beaf7a-3791-43a5-ad10-a3cb7cb1cfcf): BOTORCH_MODULAR, failed: 7 ('RESULT: <FLOAT>' not found), best RESULT: 0.1433639809, ▇█▁, requested 1 jobs, got 1, 2.89 s/job
2026-11-01 10:00:24 (d2beaf7a-3791-43a5-ad10-a3cb7cb1cfcf): BOTORCH_MODULAR, failed: 7 ('RESULT: <FLOAT>' not found), best RESULT: 0.1433639809, ▇█▁, eval #1/1 start
2026-11-01 10:00:24 (d2beaf7a-3791-43a5-ad10-a3cb7cb1cfcf): BOTORCH_MODULAR, failed: 7 ('RESULT: <FLOAT>' not found), best RESULT: 0.1433639809, ▇█▁, starting new job
2026-11-01 10:00:24 (d2beaf7a-3791-43a5-ad10-a3cb7cb1cfcf): BOTORCH_MODULAR, failed: 7 ('RESULT: <FLOAT>' not found), best RESULT: 0.1433639809, ▇█▁, started new job
2026-11-01 10:00:33 (d2beaf7a-3791-43a5-ad10-a3cb7cb1cfcf): BOTORCH_MODULAR, failed: 7 ('RESULT: <FLOAT>' not found), best RESULT: 0.1433639809, ▇█▁, job_failed
2026-11-01 10:00:33 (d2beaf7a-3791-43a5-ad10-a3cb7cb1cfcf): BOTORCH_MODULAR, failed: 8 ('RESULT: <FLOAT>' not found), best RESULT: 0.1433639809, ▇█▁, finishing jobs (get_next_trials), finished 1 job
2026-11-01 10:00:35 (d2beaf7a-3791-43a5-ad10-a3cb7cb1cfcf): BOTORCH_MODULAR, failed: 8 ('RESULT: <FLOAT>' not found), best RESULT: 0.1433639809, ▇█▁, getting new HP set (no sbatch)
2026-11-01 10:00:35 (d2beaf7a-3791-43a5-ad10-a3cb7cb1cfcf): BOTORCH_MODULAR, failed: 8 ('RESULT: <FLOAT>' not found), best RESULT: 0.1433639809, ▇█▁, requested 1 jobs, got 1, 1.51 s/job
2026-11-01 10:00:35 (d2beaf7a-3791-43a5-ad10-a3cb7cb1cfcf): BOTORCH_MODULAR, failed: 8 ('RESULT: <FLOAT>' not found), best RESULT: 0.1433639809, ▇█▁, eval #1/1 start
2026-11-01 10:00:35 (d2beaf7a-3791-43a5-ad10-a3cb7cb1cfcf): BOTORCH_MODULAR, failed: 8 ('RESULT: <FLOAT>' not found), best RESULT: 0.1433639809, ▇█▁, starting new job
2026-11-01 10:00:35 (d2beaf7a-3791-43a5-ad10-a3cb7cb1cfcf): BOTORCH_MODULAR, failed: 8 ('RESULT: <FLOAT>' not found), best RESULT: 0.1433639809, ▇█▁, started new job
2026-11-01 10:00:44 (d2beaf7a-3791-43a5-ad10-a3cb7cb1cfcf): BOTORCH_MODULAR, failed: 8 ('RESULT: <FLOAT>' not found), best RESULT: 0.1433639809, ▇█▁, job_failed
2026-11-01 10:00:44 (d2beaf7a-3791-43a5-ad10-a3cb7cb1cfcf): BOTORCH_MODULAR, failed: 9 ('RESULT: <FLOAT>' not found), best RESULT: 0.1433639809, ▇█▁, finishing jobs (get_next_trials), finished 1 job
2026-11-01 10:00:45 (d2beaf7a-3791-43a5-ad10-a3cb7cb1cfcf): BOTORCH_MODULAR, failed: 9 ('RESULT: <FLOAT>' not found), best RESULT: 0.1433639809, ▇█▁, getting new HP set (no sbatch)
2026-11-01 10:00:45 (d2beaf7a-3791-43a5-ad10-a3cb7cb1cfcf): BOTORCH_MODULAR, failed: 9 ('RESULT: <FLOAT>' not found), best RESULT: 0.1433639809, ▇█▁, requested 1 jobs, got 1, 1.57 s/job
2026-11-01 10:00:45 (d2beaf7a-3791-43a5-ad10-a3cb7cb1cfcf): BOTORCH_MODULAR, failed: 9 ('RESULT: <FLOAT>' not found), best RESULT: 0.1433639809, ▇█▁, eval #1/1 start
2026-11-01 10:00:45 (d2beaf7a-3791-43a5-ad10-a3cb7cb1cfcf): BOTORCH_MODULAR, failed: 9 ('RESULT: <FLOAT>' not found), best RESULT: 0.1433639809, ▇█▁, starting new job
2026-11-01 10:00:46 (d2beaf7a-3791-43a5-ad10-a3cb7cb1cfcf): BOTORCH_MODULAR, failed: 9 ('RESULT: <FLOAT>' not found), best RESULT: 0.1433639809, ▇█▁, started new job
2026-11-01 10:00:55 (d2beaf7a-3791-43a5-ad10-a3cb7cb1cfcf): BOTORCH_MODULAR, failed: 9 ('RESULT: <FLOAT>' not found), best RESULT: 0.1433639809, ▇█▁, new result: RESULT: 1525120974.000000
2026-11-01 10:00:56 (d2beaf7a-3791-43a5-ad10-a3cb7cb1cfcf): BOTORCH_MODULAR, failed: 9 ('RESULT: <FLOAT>' not found), best RESULT: 0.1433639809, ▇█▇▁, finishing jobs (get_next_trials), finished 1 job
2026-11-01 10:00:58 (d2beaf7a-3791-43a5-ad10-a3cb7cb1cfcf): BOTORCH_MODULAR, failed: 9 ('RESULT: <FLOAT>' not found), best RESULT: 0.1433639809, ▇█▇▁, getting new HP set (no sbatch)
2026-11-01 10:00:58 (d2beaf7a-3791-43a5-ad10-a3cb7cb1cfcf): BOTORCH_MODULAR, failed: 9 ('RESULT: <FLOAT>' not found), best RESULT: 0.1433639809, ▇█▇▁, requested 1 jobs, got 1, 1.70 s/job
2026-11-01 10:00:58 (d2beaf7a-3791-43a5-ad10-a3cb7cb1cfcf): BOTORCH_MODULAR, failed: 9 ('RESULT: <FLOAT>' not found), best RESULT: 0.1433639809, ▇█▇▁, eval #1/1 start
2026-11-01 10:00:58 (d2beaf7a-3791-43a5-ad10-a3cb7cb1cfcf): BOTORCH_MODULAR, failed: 9 ('RESULT: <FLOAT>' not found), best RESULT: 0.1433639809, ▇█▇▁, starting new job
2026-11-01 10:00:58 (d2beaf7a-3791-43a5-ad10-a3cb7cb1cfcf): BOTORCH_MODULAR, failed: 9 ('RESULT: <FLOAT>' not found), best RESULT: 0.1433639809, ▇█▇▁, started new job
2026-11-01 10:01:07 (d2beaf7a-3791-43a5-ad10-a3cb7cb1cfcf): BOTORCH_MODULAR, failed: 9 ('RESULT: <FLOAT>' not found), best RESULT: 0.1433639809, ▇█▇▁, new result: RESULT: 1614828690.000000
2026-11-01 10:01:08 (d2beaf7a-3791-43a5-ad10-a3cb7cb1cfcf): BOTORCH_MODULAR, failed: 9 ('RESULT: <FLOAT>' not found), best RESULT: 0.1433639809, ▇█▇▁▁, finishing jobs (get_next_trials), finished 1 job
2026-11-01 10:01:09 (d2beaf7a-3791-43a5-ad10-a3cb7cb1cfcf): BOTORCH_MODULAR, failed: 9 ('RESULT: <FLOAT>' not found), best RESULT: 0.1433639809, ▇█▇▁▁, getting new HP set (no sbatch)
2026-11-01 10:01:10 (d2beaf7a-3791-43a5-ad10-a3cb7cb1cfcf): BOTORCH_MODULAR, failed: 9 ('RESULT: <FLOAT>' not found), best RESULT: 0.1433639809, ▇█▇▁▁, requested 1 jobs, got 1, 1.89 s/job
2026-11-01 10:01:10 (d2beaf7a-3791-43a5-ad10-a3cb7cb1cfcf): BOTORCH_MODULAR, failed: 9 ('RESULT: <FLOAT>' not found), best RESULT: 0.1433639809, ▇█▇▁▁, eval #1/1 start
2026-11-01 10:01:10 (d2beaf7a-3791-43a5-ad10-a3cb7cb1cfcf): BOTORCH_MODULAR, failed: 9 ('RESULT: <FLOAT>' not found), best RESULT: 0.1433639809, ▇█▇▁▁, starting new job
2026-11-01 10:01:10 (d2beaf7a-3791-43a5-ad10-a3cb7cb1cfcf): BOTORCH_MODULAR, failed: 9 ('RESULT: <FLOAT>' not found), best RESULT: 0.1433639809, ▇█▇▁▁, started new job
2026-11-01 10:01:19 (d2beaf7a-3791-43a5-ad10-a3cb7cb1cfcf): BOTORCH_MODULAR, failed: 9 ('RESULT: <FLOAT>' not found), best RESULT: 0.1433639809, ▇█▇▁▁, job_failed
2026-11-01 10:01:20 (d2beaf7a-3791-43a5-ad10-a3cb7cb1cfcf): BOTORCH_MODULAR, failed: 10 ('RESULT: <FLOAT>' not found), best RESULT: 0.1433639809, ▇█▇▁▁, finishing jobs (get_next_trials), finished 1 job
2026-11-01 10:01:20 (d2beaf7a-3791-43a5-ad10-a3cb7cb1cfcf): BOTORCH_MODULAR, failed: 10 ('RESULT: <FLOAT>' not found), best RESULT: 0.1433639809, ▇█▇▁▁, getting new HP set (no sbatch)
2026-11-01 10:01:20 (d2beaf7a-3791-43a5-ad10-a3cb7cb1cfcf): BOTORCH_MODULAR, failed: 10 ('RESULT: <FLOAT>' not found), best RESULT: 0.1433639809, ▇█▇▁▁, requested 1 jobs, got 1, 0.54 s/job
2026-11-01 10:01:20 (d2beaf7a-3791-43a5-ad10-a3cb7cb1cfcf): BOTORCH_MODULAR, failed: 10 ('RESULT: <FLOAT>' not found), best RESULT: 0.1433639809, ▇█▇▁▁, eval #1/1 start
2026-11-01 10:01:20 (d2beaf7a-3791-43a5-ad10-a3cb7cb1cfcf): BOTORCH_MODULAR, failed: 10 ('RESULT: <FLOAT>' not found), best RESULT: 0.1433639809, ▇█▇▁▁, starting new job
2026-11-01 10:01:20 (d2beaf7a-3791-43a5-ad10-a3cb7cb1cfcf): BOTORCH_MODULAR, failed: 10 ('RESULT: <FLOAT>' not found), best RESULT: 0.1433639809, ▇█▇▁▁, started new job
2026-11-01 10:01:29 (d2beaf7a-3791-43a5-ad10-a3cb7cb1cfcf): BOTORCH_MODULAR, failed: 10 ('RESULT: <FLOAT>' not found), best RESULT: 0.1433639809, ▇█▇▁▁, job_failed
2026-11-01 10:01:29 (d2beaf7a-3791-43a5-ad10-a3cb7cb1cfcf): BOTORCH_MODULAR, failed: 11 ('RESULT: <FLOAT>' not found), best RESULT: 0.1433639809, ▇█▇▁▁, finishing jobs (get_next_trials), finished 1 job
2026-11-01 10:01:30 (d2beaf7a-3791-43a5-ad10-a3cb7cb1cfcf): BOTORCH_MODULAR, failed: 11 ('RESULT: <FLOAT>' not found), best RESULT: 0.1433639809, ▇█▇▁▁, getting new HP set (no sbatch)
2026-11-01 10:01:31 (d2beaf7a-3791-43a5-ad10-a3cb7cb1cfcf): BOTORCH_MODULAR, failed: 11 ('RESULT: <FLOAT>' not found), best RESULT: 0.1433639809, ▇█▇▁▁, requested 1 jobs, got 1, 1.67 s/job
2026-11-01 10:01:31 (d2beaf7a-3791-43a5-ad10-a3cb7cb1cfcf): BOTORCH_MODULAR, failed: 11 ('RESULT: <FLOAT>' not found), best RESULT: 0.1433639809, ▇█▇▁▁, eval #1/1 start
2026-11-01 10:01:31 (d2beaf7a-3791-43a5-ad10-a3cb7cb1cfcf): BOTORCH_MODULAR, failed: 11 ('RESULT: <FLOAT>' not found), best RESULT: 0.1433639809, ▇█▇▁▁, starting new job
2026-11-01 10:01:31 (d2beaf7a-3791-43a5-ad10-a3cb7cb1cfcf): BOTORCH_MODULAR, failed: 11 ('RESULT: <FLOAT>' not found), best RESULT: 0.1433639809, ▇█▇▁▁, started new job
2026-11-01 10:01:40 (d2beaf7a-3791-43a5-ad10-a3cb7cb1cfcf): BOTORCH_MODULAR, failed: 11 ('RESULT: <FLOAT>' not found), best RESULT: 0.1433639809, ▇█▇▁▁, job_failed
2026-11-01 10:01:40 (d2beaf7a-3791-43a5-ad10-a3cb7cb1cfcf): BOTORCH_MODULAR, failed: 12 ('RESULT: <FLOAT>' not found), best RESULT: 0.1433639809, ▇█▇▁▁, finishing jobs (get_next_trials), finished 1 job
2026-11-01 10:01:41 (d2beaf7a-3791-43a5-ad10-a3cb7cb1cfcf): BOTORCH_MODULAR, failed: 12 ('RESULT: <FLOAT>' not found), best RESULT: 0.1433639809, ▇█▇▁▁, getting new HP set (no sbatch)
2026-11-01 10:01:41 (d2beaf7a-3791-43a5-ad10-a3cb7cb1cfcf): BOTORCH_MODULAR, failed: 12 ('RESULT: <FLOAT>' not found), best RESULT: 0.1433639809, ▇█▇▁▁, requested 1 jobs, got 1, 0.93 s/job
2026-11-01 10:01:41 (d2beaf7a-3791-43a5-ad10-a3cb7cb1cfcf): BOTORCH_MODULAR, failed: 12 ('RESULT: <FLOAT>' not found), best RESULT: 0.1433639809, ▇█▇▁▁, eval #1/1 start
2026-11-01 10:01:41 (d2beaf7a-3791-43a5-ad10-a3cb7cb1cfcf): BOTORCH_MODULAR, failed: 12 ('RESULT: <FLOAT>' not found), best RESULT: 0.1433639809, ▇█▇▁▁, starting new job
2026-11-01 10:01:41 (d2beaf7a-3791-43a5-ad10-a3cb7cb1cfcf): BOTORCH_MODULAR, failed: 12 ('RESULT: <FLOAT>' not found), best RESULT: 0.1433639809, ▇█▇▁▁, started new job
2026-11-01 10:01:51 (d2beaf7a-3791-43a5-ad10-a3cb7cb1cfcf): BOTORCH_MODULAR, failed: 12 ('RESULT: <FLOAT>' not found), best RESULT: 0.1433639809, ▇█▇▁▁, job_failed
2026-11-01 10:01:51 (d2beaf7a-3791-43a5-ad10-a3cb7cb1cfcf): BOTORCH_MODULAR, failed: 13 ('RESULT: <FLOAT>' not found), best RESULT: 0.1433639809, ▇█▇▁▁, finishing jobs (get_next_trials), finished 1 job
2026-11-01 10:01:51 (d2beaf7a-3791-43a5-ad10-a3cb7cb1cfcf): BOTORCH_MODULAR, failed: 13 ('RESULT: <FLOAT>' not found), best RESULT: 0.1433639809, ▇█▇▁▁, getting new HP set (no sbatch)
2026-11-01 10:01:52 (d2beaf7a-3791-43a5-ad10-a3cb7cb1cfcf): BOTORCH_MODULAR, failed: 13 ('RESULT: <FLOAT>' not found), best RESULT: 0.1433639809, ▇█▇▁▁, requested 1 jobs, got 1, 0.95 s/job
2026-11-01 10:01:52 (d2beaf7a-3791-43a5-ad10-a3cb7cb1cfcf): BOTORCH_MODULAR, failed: 13 ('RESULT: <FLOAT>' not found), best RESULT: 0.1433639809, ▇█▇▁▁, eval #1/1 start
2026-11-01 10:01:52 (d2beaf7a-3791-43a5-ad10-a3cb7cb1cfcf): BOTORCH_MODULAR, failed: 13 ('RESULT: <FLOAT>' not found), best RESULT: 0.1433639809, ▇█▇▁▁, starting new job
2026-11-01 10:01:52 (d2beaf7a-3791-43a5-ad10-a3cb7cb1cfcf): BOTORCH_MODULAR, failed: 13 ('RESULT: <FLOAT>' not found), best RESULT: 0.1433639809, ▇█▇▁▁, started new job
2026-11-01 10:02:01 (d2beaf7a-3791-43a5-ad10-a3cb7cb1cfcf): BOTORCH_MODULAR, failed: 13 ('RESULT: <FLOAT>' not found), best RESULT: 0.1433639809, ▇█▇▁▁, job_failed
2026-11-01 10:02:01 (d2beaf7a-3791-43a5-ad10-a3cb7cb1cfcf): BOTORCH_MODULAR, failed: 14 ('RESULT: <FLOAT>' not found), best RESULT: 0.1433639809, ▇█▇▁▁, finishing jobs (get_next_trials), finished 1 job
2026-11-01 10:02:02 (d2beaf7a-3791-43a5-ad10-a3cb7cb1cfcf): BOTORCH_MODULAR, failed: 14 ('RESULT: <FLOAT>' not found), best RESULT: 0.1433639809, ▇█▇▁▁, getting new HP set (no sbatch)
2026-11-01 10:02:02 (d2beaf7a-3791-43a5-ad10-a3cb7cb1cfcf): BOTORCH_MODULAR, failed: 14 ('RESULT: <FLOAT>' not found), best RESULT: 0.1433639809, ▇█▇▁▁, requested 1 jobs, got 1, 1.41 s/job
2026-11-01 10:02:03 (d2beaf7a-3791-43a5-ad10-a3cb7cb1cfcf): BOTORCH_MODULAR, failed: 14 ('RESULT: <FLOAT>' not found), best RESULT: 0.1433639809, ▇█▇▁▁, eval #1/1 start
2026-11-01 10:02:03 (d2beaf7a-3791-43a5-ad10-a3cb7cb1cfcf): BOTORCH_MODULAR, failed: 14 ('RESULT: <FLOAT>' not found), best RESULT: 0.1433639809, ▇█▇▁▁, starting new job
2026-11-01 10:02:03 (d2beaf7a-3791-43a5-ad10-a3cb7cb1cfcf): BOTORCH_MODULAR, failed: 14 ('RESULT: <FLOAT>' not found), best RESULT: 0.1433639809, ▇█▇▁▁, started new job
2026-11-01 10:02:12 (d2beaf7a-3791-43a5-ad10-a3cb7cb1cfcf): BOTORCH_MODULAR, failed: 14 ('RESULT: <FLOAT>' not found), best RESULT: 0.1433639809, ▇█▇▁▁, job_failed
2026-11-01 10:02:12 (d2beaf7a-3791-43a5-ad10-a3cb7cb1cfcf): BOTORCH_MODULAR, failed: 15 ('RESULT: <FLOAT>' not found), best RESULT: 0.1433639809, ▇█▇▁▁, finishing jobs, finished 1 job
2026-11-01 10:02:12 (d2beaf7a-3791-43a5-ad10-a3cb7cb1cfcf): BOTORCH_MODULAR, failed: 15 ('RESULT: <FLOAT>' not found), best RESULT: 0.1433639809, ▇█▇▁▁, getting new HP set (no sbatch)
2026-11-01 10:02:13 (d2beaf7a-3791-43a5-ad10-a3cb7cb1cfcf): BOTORCH_MODULAR, failed: 15 ('RESULT: <FLOAT>' not found), best RESULT: 0.1433639809, ▇█▇▁▁, requested 1 jobs, got 1, 1.03 s/job
2026-11-01 10:02:13 (d2beaf7a-3791-43a5-ad10-a3cb7cb1cfcf): BOTORCH_MODULAR, failed: 15 ('RESULT: <FLOAT>' not found), best RESULT: 0.1433639809, ▇█▇▁▁, eval #1/1 start
2026-11-01 10:02:13 (d2beaf7a-3791-43a5-ad10-a3cb7cb1cfcf): BOTORCH_MODULAR, failed: 15 ('RESULT: <FLOAT>' not found), best RESULT: 0.1433639809, ▇█▇▁▁, starting new job
2026-11-01 10:02:13 (d2beaf7a-3791-43a5-ad10-a3cb7cb1cfcf): BOTORCH_MODULAR, failed: 15 ('RESULT: <FLOAT>' not found), best RESULT: 0.1433639809, ▇█▇▁▁, started new job
2026-11-01 10:02:22 (d2beaf7a-3791-43a5-ad10-a3cb7cb1cfcf): BOTORCH_MODULAR, failed: 15 ('RESULT: <FLOAT>' not found), best RESULT: 0.1433639809, ▇█▇▁▁, job_failed
2026-11-01 10:02:22 (d2beaf7a-3791-43a5-ad10-a3cb7cb1cfcf): BOTORCH_MODULAR, failed: 16 ('RESULT: <FLOAT>' not found), best RESULT: 0.1433639809, ▇█▇▁▁, finishing jobs (get_next_trials), finished 1 job
2026-11-01 10:02:23 (d2beaf7a-3791-43a5-ad10-a3cb7cb1cfcf): BOTORCH_MODULAR, failed: 16 ('RESULT: <FLOAT>' not found), best RESULT: 0.1433639809, ▇█▇▁▁, getting new HP set (no sbatch)
2026-11-01 10:02:24 (d2beaf7a-3791-43a5-ad10-a3cb7cb1cfcf): BOTORCH_MODULAR, failed: 16 ('RESULT: <FLOAT>' not found), best RESULT: 0.1433639809, ▇█▇▁▁, requested 1 jobs, got 1, 1.91 s/job
2026-11-01 10:02:24 (d2beaf7a-3791-43a5-ad10-a3cb7cb1cfcf): BOTORCH_MODULAR, failed: 16 ('RESULT: <FLOAT>' not found), best RESULT: 0.1433639809, ▇█▇▁▁, eval #1/1 start
2026-11-01 10:02:24 (d2beaf7a-3791-43a5-ad10-a3cb7cb1cfcf): BOTORCH_MODULAR, failed: 16 ('RESULT: <FLOAT>' not found), best RESULT: 0.1433639809, ▇█▇▁▁, starting new job
2026-11-01 10:02:24 (d2beaf7a-3791-43a5-ad10-a3cb7cb1cfcf): BOTORCH_MODULAR, failed: 16 ('RESULT: <FLOAT>' not found), best RESULT: 0.1433639809, ▇█▇▁▁, started new job
2026-11-01 10:02:33 (d2beaf7a-3791-43a5-ad10-a3cb7cb1cfcf): BOTORCH_MODULAR, failed: 16 ('RESULT: <FLOAT>' not found), best RESULT: 0.1433639809, ▇█▇▁▁, job_failed
2026-11-01 10:02:34 (d2beaf7a-3791-43a5-ad10-a3cb7cb1cfcf): BOTORCH_MODULAR, failed: 17 ('RESULT: <FLOAT>' not found), best RESULT: 0.1433639809, ▇█▇▁▁, finishing jobs (get_next_trials), finished 1 job
2026-11-01 10:02:34 (d2beaf7a-3791-43a5-ad10-a3cb7cb1cfcf): BOTORCH_MODULAR, failed: 17 ('RESULT: <FLOAT>' not found), best RESULT: 0.1433639809, ▇█▇▁▁, getting new HP set (no sbatch)
2026-11-01 10:02:37 (d2beaf7a-3791-43a5-ad10-a3cb7cb1cfcf): BOTORCH_MODULAR, failed: 17 ('RESULT: <FLOAT>' not found), best RESULT: 0.1433639809, ▇█▇▁▁, requested 1 jobs, got 1, 3.44 s/job
2026-11-01 10:02:37 (d2beaf7a-3791-43a5-ad10-a3cb7cb1cfcf): BOTORCH_MODULAR, failed: 17 ('RESULT: <FLOAT>' not found), best RESULT: 0.1433639809, ▇█▇▁▁, eval #1/1 start
2026-11-01 10:02:37 (d2beaf7a-3791-43a5-ad10-a3cb7cb1cfcf): BOTORCH_MODULAR, failed: 17 ('RESULT: <FLOAT>' not found), best RESULT: 0.1433639809, ▇█▇▁▁, starting new job
2026-11-01 10:02:37 (d2beaf7a-3791-43a5-ad10-a3cb7cb1cfcf): BOTORCH_MODULAR, failed: 17 ('RESULT: <FLOAT>' not found), best RESULT: 0.1433639809, ▇█▇▁▁, started new job
2026-11-01 10:02:46 (d2beaf7a-3791-43a5-ad10-a3cb7cb1cfcf): BOTORCH_MODULAR, failed: 17 ('RESULT: <FLOAT>' not found), best RESULT: 0.1433639809, ▇█▇▁▁, job_failed
2026-11-01 10:02:47 (d2beaf7a-3791-43a5-ad10-a3cb7cb1cfcf): BOTORCH_MODULAR, failed: 18 ('RESULT: <FLOAT>' not found), best RESULT: 0.1433639809, ▇█▇▁▁, finishing jobs (get_next_trials), finished 1 job
2026-11-01 10:02:48 (d2beaf7a-3791-43a5-ad10-a3cb7cb1cfcf): BOTORCH_MODULAR, failed: 18 ('RESULT: <FLOAT>' not found), best RESULT: 0.1433639809, ▇█▇▁▁, getting new HP set (no sbatch)
2026-11-01 10:02:57 (d2beaf7a-3791-43a5-ad10-a3cb7cb1cfcf): BOTORCH_MODULAR, failed: 18 ('RESULT: <FLOAT>' not found), best RESULT: 0.1433639809, ▇█▇▁▁, requested 1 jobs, got 0, n/a
2026-11-01 10:02:58 (d2beaf7a-3791-43a5-ad10-a3cb7cb1cfcf): BOTORCH_MODULAR, failed: 18 ('RESULT: <FLOAT>' not found), best RESULT: 0.1433639809, ▇█▇▁▁, getting new HP set (no sbatch)
2026-11-01 10:03:08 (d2beaf7a-3791-43a5-ad10-a3cb7cb1cfcf): BOTORCH_MODULAR, failed: 18 ('RESULT: <FLOAT>' not found), best RESULT: 0.1433639809, ▇█▇▁▁, requested 1 jobs, got 0, n/a
2026-11-01 10:03:09 (d2beaf7a-3791-43a5-ad10-a3cb7cb1cfcf): BOTORCH_MODULAR, failed: 18 ('RESULT: <FLOAT>' not found), best RESULT: 0.1433639809, ▇█▇▁▁, getting new HP set (no sbatch)
2026-11-01 10:03:18 (d2beaf7a-3791-43a5-ad10-a3cb7cb1cfcf): BOTORCH_MODULAR, failed: 18 ('RESULT: <FLOAT>' not found), best RESULT: 0.1433639809, ▇█▇▁▁, requested 1 jobs, got 0, n/a
2026-11-01 10:03:18 (d2beaf7a-3791-43a5-ad10-a3cb7cb1cfcf): BOTORCH_MODULAR, failed: 18 ('RESULT: <FLOAT>' not found), best RESULT: 0.1433639809, ▇█▇▁▁, getting new HP set (no sbatch)
2026-11-01 10:03:28 (d2beaf7a-3791-43a5-ad10-a3cb7cb1cfcf): BOTORCH_MODULAR, failed: 18 ('RESULT: <FLOAT>' not found), best RESULT: 0.1433639809, ▇█▇▁▁, requested 1 jobs, got 0, n/a
2026-11-01 10:03:29 (d2beaf7a-3791-43a5-ad10-a3cb7cb1cfcf): BOTORCH_MODULAR, failed: 18 ('RESULT: <FLOAT>' not found), best RESULT: 0.1433639809, ▇█▇▁▁, getting new HP set (no sbatch)
2026-11-01 10:03:39 (d2beaf7a-3791-43a5-ad10-a3cb7cb1cfcf): BOTORCH_MODULAR, failed: 18 ('RESULT: <FLOAT>' not found), best RESULT: 0.1433639809, ▇█▇▁▁, requested 1 jobs, got 0, n/a
2026-11-01 10:03:40 (d2beaf7a-3791-43a5-ad10-a3cb7cb1cfcf): BOTORCH_MODULAR, failed: 18 ('RESULT: <FLOAT>' not found), best RESULT: 0.1433639809, ▇█▇▁▁, getting new HP set (no sbatch)
2026-11-01 10:03:50 (d2beaf7a-3791-43a5-ad10-a3cb7cb1cfcf): BOTORCH_MODULAR, failed: 18 ('RESULT: <FLOAT>' not found), best RESULT: 0.1433639809, ▇█▇▁▁, requested 1 jobs, got 0, n/a
2026-11-01 10:03:50 (d2beaf7a-3791-43a5-ad10-a3cb7cb1cfcf): BOTORCH_MODULAR, failed: 18 ('RESULT: <FLOAT>' not found), best RESULT: 0.1433639809, ▇█▇▁▁, getting new HP set (no sbatch)
2026-11-01 10:04:00 (d2beaf7a-3791-43a5-ad10-a3cb7cb1cfcf): BOTORCH_MODULAR, failed: 18 ('RESULT: <FLOAT>' not found), best RESULT: 0.1433639809, ▇█▇▁▁, requested 1 jobs, got 0, n/a
2026-11-01 10:04:00 (d2beaf7a-3791-43a5-ad10-a3cb7cb1cfcf): BOTORCH_MODULAR, failed: 18 ('RESULT: <FLOAT>' not found), best RESULT: 0.1433639809, ▇█▇▁▁, found 1 zero-jobs (max: 3)
! No notable correlations between parameters were found (threshold: |r| > 0.3).
Top-5 Best Results
Parameter Sensitivity Ranking
Parameters ranked by absolute Pearson correlation with each result. Stronger correlations (|r| ≥ 0.7) suggest the parameter has more influence on the outcome.
Convergence Analysis
Parameter statistics
Parameter
Min
Max
Mean
Std Dev
Count
run_time
6
12
6.2609
1.2236
23
RESULT
0.1434
1614828690
628988451.6287
768837854.9014
5
program
No numerical statistics available
Show SLURM-Job-ID (if it exists)
Some single-run logs were not shared
By default only logs from failed or interrupted jobs are shared. Successful logs and logs above the upload cap were left out.
single_runs/16209 — successful job (logs are skipped by default)
single_runs/16264 — successful job (logs are skipped by default)
To see these logs here as well, run one of these commands on the machine that has the run folder: