⚠ Raw data does not conform to the expected structure. Expected either a tuple of (mean, SEM) or a float, but got None.
Run-UUID: 2535c1d0-522a-48e2-bb63-4e3ecfe0212a
__ __ __
/\_\/ o /\_\/ / )
| | _ _ _ _ _ | | _ _|_ /
| |/ |/ |/ | / |/ | | | ||/ \_| /
\__/ | | |_/ | |_/|_/\__/ |__/ |_//___
/|
\|
./omniopt --max_nr_of_zero_results 3 --live_share --send_anonymized_usage_stats --partition=alpha --gpus=0 --experiment_name=test_wronggoing_stuff --mem_gb=1 --time=120 --worker_timeout=1 --max_eval=23 --num_parallel_jobs=10 --run_program Li8udGVzdHMvdGVzdF93cm9uZ2dvaW5nX3N0dWZmLmJpbi9iaW4vJShwcm9ncmFtKQ== --parameter program choice divide_by_0,simple_ok,perl,exit_code_137,result_but_exit_code_stdout_stderr,exit_code_stdout,signal_but_has_output,exit_code_no_output,exit_code_stdout_stderr,module_not_found,signal,empty,file_does_not_exist,sleep_10_and_result_exit_252,no_chmod_x,no_shebang,perl_module_fail,segfault,wrong_arch,python_name_error,syntax_error,tensorflow_syntax_error,force_keyboard_interrupt --num_random_steps=1 --follow
Run-folder: /home/runner/work/OmniOpt/OmniOpt/runs/test_wronggoing_stuff/0See https://imageseg.scads.de/omniax/share?user_id=runner&experiment_name=test_wronggoing_stuff&run_nr=156 for live-results.
You have 4 CPUs available for the main process.No CUDA devices found.Generation strategy: SOBOL for 1 step and then BOTORCH_MODULAR for 22 steps.
Run-Program: ./.tests/test_wronggoing_stuff.bin/bin/%(program)
Experiment parameters
┏━━━━━━━━━┳━━━━━━━━┳━━━━━━━━━━━━━━━━━━━━━━━━━━━━━━━━━━━━━━━━━━━━━━━━━━━━━━━━━━━┓
┃Name ┃Type ┃Values ┃
┡━━━━━━━━━╇━━━━━━━━╇━━━━━━━━━━━━━━━━━━━━━━━━━━━━━━━━━━━━━━━━━━━━━━━━━━━━━━━━━━━┩
│program│choice│divide_by_0, simple_ok, perl, exit_code_137, │
│││result_but_exit_code_stdout_stderr, exit_code_stdout, │
│││signal_but_has_output, exit_code_no_output, │
│││exit_code_stdout_stderr, module_not_found, signal, empty,│
│││file_does_not_exist, sleep_10_and_result_exit_252, │
│││no_chmod_x, no_shebang, perl_module_fail, segfault, │
│││wrong_arch, python_name_error, syntax_error, │
│││tensorflow_syntax_error, force_keyboard_interrupt │
└─────────┴────────┴───────────────────────────────────────────────────────────┘
Result-Names
┏━━━━━━━━━━━━━┳━━━━━━━━━━━━━┓
┃Result-Name┃Min or max?┃
┡━━━━━━━━━━━━━╇━━━━━━━━━━━━━┩
│RESULT │ min│
└─────────────┴─────────────┘
╭────────────────OmniOpt evaluation failed - quick diagnosis─────────────────╮│││ Command: ./.tests/test_wronggoing_stuff.bin/bin/exit_code_137 ││ Working dir: /home/runner/work/OmniOpt/OmniOpt ││ Exit code: 137 ││ Signal: SIGKILL (9) ││ Parsed result: {'RESULT': None} ││ Likely cause(s) and how to fix: ││ - The process was killed by SIGKILL. This is often the OOM killer. Try ││ more memory (--mem_gb, currently 1 GB) or reduce the memory usage of your ││ program. ││ - Your program produced no stdout. OmniOpt reads results from stdout, so ││ print something like 'RESULT: 1.23'. ││ - Missing numeric result(s) for: RESULT. │││╰──────────────────────────────────────────────────────────────────────────────╯
⚠ Raw data does not conform to the expected structure. Expected either a tuple of (mean, SEM) or a float, but got None.╭────────────────OmniOpt evaluation failed - quick diagnosis─────────────────╮│││ Command: ./.tests/test_wronggoing_stuff.bin/bin/no_shebang ││ Working dir: /home/runner/work/OmniOpt/OmniOpt ││ Exit code: 2 ││ Parsed result: {'RESULT': None} ││ Likely cause(s) and how to fix: ││ - Your program produced no stdout. OmniOpt reads results from stdout, so ││ print something like 'RESULT: 1.23'. ││ - Missing numeric result(s) for: RESULT. ││ - Your program exited with code 2. Check the stderr/traceback above. ││ Relevant output (last lines): ││ import-im6.q16: unable to open X server `' @ ││ error/import.c/ImportImageCommand/346. ││ ./.tests/test_wronggoing_stuff.bin/bin/no_shebang: 2: Syntax error: word ││ unexpected (expecting ")") │││╰──────────────────────────────────────────────────────────────────────────────╯
⚠ Raw data does not conform to the expected structure. Expected either a tuple of (mean, SEM) or a float, but got None.╭────────────────OmniOpt evaluation failed - quick diagnosis─────────────────╮│││ Command: ./.tests/test_wronggoing_stuff.bin/bin/python_name_error ││ Working dir: /home/runner/work/OmniOpt/OmniOpt ││ Exit code: 1 ││ Parsed result: {'RESULT': None} ││ Likely cause(s) and how to fix: ││ - Your program raised a Python exception: NameError: name 'askldasdasd' ││ is not defined. Fix the traceback shown above. ││ - Your program produced no stdout. OmniOpt reads results from stdout, so ││ print something like 'RESULT: 1.23'. ││ - Missing numeric result(s) for: RESULT. ││ Relevant output (last lines): ││ Traceback (most recent call last): ││ File ││ "/home/runner/work/OmniOpt/OmniOpt/./.tests/test_wronggoing_stuff.bin/bin/ ││ python_name_error", line 2, in ││ askldasdasd ││ NameError: name 'askldasdasd' is not defined │││╰──────────────────────────────────────────────────────────────────────────────╯
⚠ Raw data does not conform to the expected structure. Expected either a tuple of (mean, SEM) or a float, but got None.╭────────────────OmniOpt evaluation failed - quick diagnosis─────────────────╮│││ Command: ./.tests/test_wronggoing_stuff.bin/bin/exit_code_stdout ││ Working dir: /home/runner/work/OmniOpt/OmniOpt ││ Exit code: 5 ││ Parsed result: {'RESULT': 1955307364.0} ││ Likely cause(s) and how to fix: ││ - Your program produced a valid result but still exited with code 5. ││ OmniOpt may count this evaluation as successful; fix the exit code if that ││ is not intended. ││ Relevant output (last lines): ││ STDERR │││╰──────────────────────────────────────────────────────────────────────────────╯╭────────────────OmniOpt evaluation failed - quick diagnosis─────────────────╮│││ Command: ││ ./.tests/test_wronggoing_stuff.bin/bin/sleep_10_and_result_exit_252 ││ Working dir: /home/runner/work/OmniOpt/OmniOpt ││ Exit code: 252 ││ Signal: signal 124 (124) ││ Parsed result: {'RESULT': 1234.0} ││ Likely cause(s) and how to fix: ││ - The process was terminated by signal 124 (124). ││ - Your program produced a valid result but still exited with code 252. ││ OmniOpt may count this evaluation as successful; fix the exit code if that ││ is not intended. ││ Relevant output (last lines): ││ RESULT: 1234 │││╰──────────────────────────────────────────────────────────────────────────────╯╭────────────────OmniOpt evaluation failed - quick diagnosis─────────────────╮│││ Command: ./.tests/test_wronggoing_stuff.bin/bin/wrong_arch ││ Working dir: /home/runner/work/OmniOpt/OmniOpt ││ Exit code: 126 ││ Parsed result: {'RESULT': None} ││ Likely cause(s) and how to fix: ││ - Your program produced no stdout. OmniOpt reads results from stdout, so ││ print something like 'RESULT: 1.23'. ││ - Missing numeric result(s) for: RESULT. ││ - Your program exited with code 126 (Command Invoked Cannot Execute - ││ Permission problem or command is not an executable or it was compiled for ││ a different platform). Check the stderr/traceback above. ││ Relevant output (last lines): ││ /bin/sh: 1: ./.tests/test_wronggoing_stuff.bin/bin/wrong_arch: Exec ││ format error │││╰──────────────────────────────────────────────────────────────────────────────╯
⚠ Raw data does not conform to the expected structure. Expected either a tuple of (mean, SEM) or a float, but got None.╭────────────────OmniOpt evaluation failed - quick diagnosis─────────────────╮│││ Command: ./.tests/test_wronggoing_stuff.bin/bin/syntax_error ││ Working dir: /home/runner/work/OmniOpt/OmniOpt ││ Exit code: 1 ││ Parsed result: {'RESULT': None} ││ Likely cause(s) and how to fix: ││ - Your program produced no stdout. OmniOpt reads results from stdout, so ││ print something like 'RESULT: 1.23'. ││ - Missing numeric result(s) for: RESULT. ││ - Your program exited with code 1. Check the stderr/traceback above. ││ Relevant output (last lines): ││ File ││ "/home/runner/work/OmniOpt/OmniOpt/./.tests/test_wronggoing_stuff.bin/bin/ ││ syntax_error", line 3 ││ def x () {} ││ ^ ││ SyntaxError: expected ':' │││╰──────────────────────────────────────────────────────────────────────────────╯
⚠ Raw data does not conform to the expected structure. Expected either a tuple of (mean, SEM) or a float, but got None.╭────────────────OmniOpt evaluation failed - quick diagnosis─────────────────╮│││ Command: ./.tests/test_wronggoing_stuff.bin/bin/no_chmod_x ││ Working dir: /home/runner/work/OmniOpt/OmniOpt ││ Exit code: 126 ││ Parsed result: {'RESULT': None} ││ Likely cause(s) and how to fix: ││ - A file or command was not executable. Run 'chmod +x ' or ││ invoke the script explicitly with 'bash ' / 'python3 '. ││ - Your program produced no stdout. OmniOpt reads results from stdout, so ││ print something like 'RESULT: 1.23'. ││ - Missing numeric result(s) for: RESULT. ││ Relevant output (last lines): ││ /bin/sh: 1: ./.tests/test_wronggoing_stuff.bin/bin/no_chmod_x: ││ Permission denied │││╰──────────────────────────────────────────────────────────────────────────────╯
⚠ Raw data does not conform to the expected structure. Expected either a tuple of (mean, SEM) or a float, but got None.╭────────────────OmniOpt evaluation failed - quick diagnosis─────────────────╮│││ Command: ││ ./.tests/test_wronggoing_stuff.bin/bin/tensorflow_syntax_error ││ Working dir: /home/runner/work/OmniOpt/OmniOpt ││ Exit code: 1 ││ Parsed result: {'RESULT': None} ││ Likely cause(s) and how to fix: ││ - The Python module 'tensorflow' is missing. Install it in the ││ environment used by your program, for example with 'pip install ││ tensorflow'. ││ - Your program raised a Python exception: ModuleNotFoundError: No module ││ named 'tensorflow'. Fix the traceback shown above. ││ - Your program produced no stdout. OmniOpt reads results from stdout, so ││ print something like 'RESULT: 1.23'. ││ - Missing numeric result(s) for: RESULT. ││ Relevant output (last lines): ││ Traceback (most recent call last): ││ File ││ "/home/runner/work/OmniOpt/OmniOpt/./.tests/test_wronggoing_stuff.bin/bin/ ││ tensorflow_syntax_error", line 3, in ││ import tensorflow as tf ││ ModuleNotFoundError: No module named 'tensorflow' │││╰──────────────────────────────────────────────────────────────────────────────╯
⚠ Raw data does not conform to the expected structure. Expected either a tuple of (mean, SEM) or a float, but got None.╭────────────────OmniOpt evaluation failed - quick diagnosis─────────────────╮│││ Command: ./.tests/test_wronggoing_stuff.bin/bin/exit_code_no_output ││ Working dir: /home/runner/work/OmniOpt/OmniOpt ││ Exit code: 5 ││ Parsed result: {'RESULT': None} ││ Likely cause(s) and how to fix: ││ - Your program produced no stdout. OmniOpt reads results from stdout, so ││ print something like 'RESULT: 1.23'. ││ - Missing numeric result(s) for: RESULT. ││ - Your program exited with code 5. Check the stderr/traceback above. │││╰──────────────────────────────────────────────────────────────────────────────╯
⚠ Raw data does not conform to the expected structure. Expected either a tuple of (mean, SEM) or a float, but got None.╭────────────────OmniOpt evaluation failed - quick diagnosis─────────────────╮│││ Command: ./.tests/test_wronggoing_stuff.bin/bin/signal ││ Working dir: /home/runner/work/OmniOpt/OmniOpt ││ Exit code: 137 ││ Signal: SIGKILL (9) ││ Parsed result: {'RESULT': None} ││ Likely cause(s) and how to fix: ││ - The process was killed by SIGKILL. This is often the OOM killer. Try ││ more memory (--mem_gb, currently 1 GB) or reduce the memory usage of your ││ program. ││ - Your program produced no stdout. OmniOpt reads results from stdout, so ││ print something like 'RESULT: 1.23'. ││ - Missing numeric result(s) for: RESULT. ││ Relevant output (last lines): ││ Killed ││ Killed │││╰──────────────────────────────────────────────────────────────────────────────╯
⚠ Raw data does not conform to the expected structure. Expected either a tuple of (mean, SEM) or a float, but got None.╭────────────────OmniOpt evaluation failed - quick diagnosis─────────────────╮│││ Command: ││ ./.tests/test_wronggoing_stuff.bin/bin/exit_code_stdout_stderr ││ Working dir: /home/runner/work/OmniOpt/OmniOpt ││ Exit code: 5 ││ Parsed result: {'RESULT': None} ││ Likely cause(s) and how to fix: ││ - OmniOpt found no result in stdout. Expected RESULT: . Make ││ sure your program prints the result to stdout. ││ - Missing numeric result(s) for: RESULT. ││ - Your program exited with code 5. Check the stderr/traceback above. ││ Relevant output (last lines): ││ This has stderr │││╰──────────────────────────────────────────────────────────────────────────────╯
⚠ Raw data does not conform to the expected structure. Expected either a tuple of (mean, SEM) or a float, but got None.╭────────────────OmniOpt evaluation failed - quick diagnosis─────────────────╮│││ Command: ││ ./.tests/test_wronggoing_stuff.bin/bin/signal_but_has_output ││ Working dir: /home/runner/work/OmniOpt/OmniOpt ││ Exit code: 137 ││ Signal: SIGKILL (9) ││ Parsed result: {'RESULT': None} ││ Likely cause(s) and how to fix: ││ - The process was killed by SIGKILL. This is often the OOM killer. Try ││ more memory (--mem_gb, currently 1 GB) or reduce the memory usage of your ││ program. ││ - Your program produced no stdout. OmniOpt reads results from stdout, so ││ print something like 'RESULT: 1.23'. ││ - Missing numeric result(s) for: RESULT. ││ Relevant output (last lines): ││ Killed ││ Killed │││╰──────────────────────────────────────────────────────────────────────────────╯
⚠ Raw data does not conform to the expected structure. Expected either a tuple of (mean, SEM) or a float, but got None.╭────────────────OmniOpt evaluation failed - quick diagnosis─────────────────╮│││ Command: ./.tests/test_wronggoing_stuff.bin/bin/divide_by_0 ││ Working dir: /home/runner/work/OmniOpt/OmniOpt ││ Exit code: 255 ││ Signal: signal 127 (127) ││ Parsed result: {'RESULT': None} ││ Likely cause(s) and how to fix: ││ - The process was terminated by signal 127 (127). ││ - Your program produced no stdout. OmniOpt reads results from stdout, so ││ print something like 'RESULT: 1.23'. ││ - Missing numeric result(s) for: RESULT. ││ Relevant output (last lines): ││ Illegal division by zero at ││ ./.tests/test_wronggoing_stuff.bin/bin/divide_by_0 line 3. │││╰──────────────────────────────────────────────────────────────────────────────╯
⚠ Raw data does not conform to the expected structure. Expected either a tuple of (mean, SEM) or a float, but got None.╭────────────────OmniOpt evaluation failed - quick diagnosis─────────────────╮│││ Command: ││ ./.tests/test_wronggoing_stuff.bin/bin/force_keyboard_interrupt ││ Working dir: /home/runner/work/OmniOpt/OmniOpt ││ Exit code: 130 ││ Signal: SIGINT (2) ││ Parsed result: {'RESULT': None} ││ Likely cause(s) and how to fix: ││ - The process was terminated by SIGINT (2). ││ - Your program raised a Python exception: KeyboardInterrupt: Test error. ││ Fix the traceback shown above. ││ - Your program produced no stdout. OmniOpt reads results from stdout, so ││ print something like 'RESULT: 1.23'. ││ - Missing numeric result(s) for: RESULT. ││ Relevant output (last lines): ││ Traceback (most recent call last): ││ File ││ "/home/runner/work/OmniOpt/OmniOpt/./.tests/test_wronggoing_stuff.bin/bin/ ││ force_keyboard_interrupt", line 3, in ││ raise KeyboardInterrupt("Test error") ││ KeyboardInterrupt: Test error │││╰──────────────────────────────────────────────────────────────────────────────╯
⚠ Raw data does not conform to the expected structure. Expected either a tuple of (mean, SEM) or a float, but got None.╭────────────────OmniOpt evaluation failed - quick diagnosis─────────────────╮│││ Command: ./.tests/test_wronggoing_stuff.bin/bin/segfault ││ Working dir: /home/runner/work/OmniOpt/OmniOpt ││ Exit code: 139 ││ Signal: SIGSEGV (11) ││ Parsed result: {'RESULT': None} ││ Likely cause(s) and how to fix: ││ - The process crashed with SIGSEGV (segmentation fault). This usually ││ comes from native code, a broken C extension, CUDA/driver issues or ││ invalid memory access. ││ - Your program produced no stdout. OmniOpt reads results from stdout, so ││ print something like 'RESULT: 1.23'. ││ - Missing numeric result(s) for: RESULT. ││ Relevant output (last lines): ││ Segmentation fault (core dumped) │││╰──────────────────────────────────────────────────────────────────────────────╯
⚠ Raw data does not conform to the expected structure. Expected either a tuple of (mean, SEM) or a float, but got None.╭────────────────OmniOpt evaluation failed - quick diagnosis─────────────────╮│││ Command: ./.tests/test_wronggoing_stuff.bin/bin/perl_module_fail ││ Working dir: /home/runner/work/OmniOpt/OmniOpt ││ Exit code: 2 ││ Parsed result: {'RESULT': None} ││ Likely cause(s) and how to fix: ││ - Your program produced no stdout. OmniOpt reads results from stdout, so ││ print something like 'RESULT: 1.23'. ││ - Missing numeric result(s) for: RESULT. ││ - Your program exited with code 2. Check the stderr/traceback above. ││ Relevant output (last lines): ││ Can't locate INeverExisted.pm in @INC (you may need to install the ││ INeverExisted module) (@INC contains: /etc/perl ││ /usr/local/lib/x86_64-linux-gnu/perl/5.34.0 /usr/local/share/perl/5.34.0 ││ /usr/lib/x86_64-linux-gnu/perl5/5.34 /usr/share/p... ││ BEGIN failed--compilation aborted at ││ ./.tests/test_wronggoing_stuff.bin/bin/perl_module_fail line 3. │││╰──────────────────────────────────────────────────────────────────────────────╯
⚠ Raw data does not conform to the expected structure. Expected either a tuple of (mean, SEM) or a float, but got None.╭────────────────OmniOpt evaluation failed - quick diagnosis─────────────────╮│││ Command: ./.tests/test_wronggoing_stuff.bin/bin/empty ││ Working dir: /home/runner/work/OmniOpt/OmniOpt ││ Exit code: 126 ││ Parsed result: {'RESULT': None} ││ Likely cause(s) and how to fix: ││ - A file or command was not executable. Run 'chmod +x ' or ││ invoke the script explicitly with 'bash ' / 'python3 '. ││ - Your program produced no stdout. OmniOpt reads results from stdout, so ││ print something like 'RESULT: 1.23'. ││ - Missing numeric result(s) for: RESULT. ││ Relevant output (last lines): ││ /bin/sh: 1: ./.tests/test_wronggoing_stuff.bin/bin/empty: Permission ││ denied │││╰──────────────────────────────────────────────────────────────────────────────╯
⚠ Raw data does not conform to the expected structure. Expected either a tuple of (mean, SEM) or a float, but got None.╭────────────────OmniOpt evaluation failed - quick diagnosis─────────────────╮│││ Command: ./.tests/test_wronggoing_stuff.bin/bin/file_does_not_exist ││ Working dir: /home/runner/work/OmniOpt/OmniOpt ││ Exit code: 127 ││ Parsed result: {'RESULT': None} ││ Likely cause(s) and how to fix: ││ - The command ││ './.tests/test_wronggoing_stuff.bin/bin/file_does_not_exist' was not ││ found. Check the spelling, your PATH and whether the program is installed ││ in the environment used by OmniOpt. ││ - Your program produced no stdout. OmniOpt reads results from stdout, so ││ print something like 'RESULT: 1.23'. ││ - Missing numeric result(s) for: RESULT. ││ Relevant output (last lines): ││ /bin/sh: 1: ./.tests/test_wronggoing_stuff.bin/bin/file_does_not_exist: ││ not found │││╰──────────────────────────────────────────────────────────────────────────────╯
⚠ Raw data does not conform to the expected structure. Expected either a tuple of (mean, SEM) or a float, but got None.╭────────────────OmniOpt evaluation failed - quick diagnosis─────────────────╮│││ Command: ││ ./.tests/test_wronggoing_stuff.bin/bin/result_but_exit_code_stdout_stderr ││ Working dir: /home/runner/work/OmniOpt/OmniOpt ││ Exit code: 5 ││ Parsed result: {'RESULT': 311113719.0} ││ Likely cause(s) and how to fix: ││ - Your program produced a valid result but still exited with code 5. ││ OmniOpt may count this evaluation as successful; fix the exit code if that ││ is not intended. ││ Relevant output (last lines): ││ stderr │││╰──────────────────────────────────────────────────────────────────────────────╯╭────────────────OmniOpt evaluation failed - quick diagnosis─────────────────╮│││ Command: ./.tests/test_wronggoing_stuff.bin/bin/module_not_found ││ Working dir: /home/runner/work/OmniOpt/OmniOpt ││ Exit code: 1 ││ Parsed result: {'RESULT': None} ││ Likely cause(s) and how to fix: ││ - The Python module 'THISMODULEDOESNTEXIST' is missing. Install it in ││ the environment used by your program, for example with 'pip install ││ THISMODULEDOESNTEXIST'. ││ - Your program raised a Python exception: ModuleNotFoundError: No module ││ named 'THISMODULEDOESNTEXIST'. Fix the traceback shown above. ││ - Your program produced no stdout. OmniOpt reads results from stdout, so ││ print something like 'RESULT: 1.23'. ││ - Missing numeric result(s) for: RESULT. ││ Relevant output (last lines): ││ Traceback (most recent call last): ││ File ││ "/home/runner/work/OmniOpt/OmniOpt/./.tests/test_wronggoing_stuff.bin/bin/ ││ module_not_found", line 3, in ││ import THISMODULEDOESNTEXIST ││ ModuleNotFoundError: No module named 'THISMODULEDOESNTEXIST' │││╰──────────────────────────────────────────────────────────────────────────────╯
⚠ Raw data does not conform to the expected structure. Expected either a tuple of (mean, SEM) or a float, but got None.
Traceback (most recent call last):
File "/home/runner/.omniax_venvs/Python_3.10.12/x86_64/lib/python3.10/site-packages/ax/generation_strategy/generation_node.py", line 440, in gen
gr = self._gen_maybe_deduplicate(
File "/home/runner/.omniax_venvs/Python_3.10.12/x86_64/lib/python3.10/site-packages/ax/generation_strategy/generation_node.py", line 549, in _gen_maybe_deduplicate
raise GenerationStrategyRepeatedPoints(MAX_GEN_ATTEMPTS_EXCEEDED_MESSAGE)
ax.exceptions.generation_strategy.GenerationStrategyRepeatedPoints: GenerationStrategy exceeded `MAX_GEN_ATTEMPTS` of 5 while trying to generate a unique parameterization. This indicates that the search space has likely been fully explored, or that the sweep has converged.
During handling of the above exception, another exception occurred:
Traceback (most recent call last):
File "/home/runner/.omniax_venvs/Python_3.10.12/x86_64/lib/python3.10/site-packages/ax/generators/random/base.py", line 177, in gen
points, attempted_draws = rejection_sample(
File "/home/runner/.omniax_venvs/Python_3.10.12/x86_64/lib/python3.10/site-packages/ax/generators/utils.py", line 151, in rejection_sample
raise SearchSpaceExhausted(
ax.exceptions.core.SearchSpaceExhausted: Rejection sampling error (specified maximum draws (10000) exhausted, without finding sufficiently many (1) candidates). This likely means that there are no new points left in the search space.
During handling of the above exception, another exception occurred:
Traceback (most recent call last):
File "/home/runner/work/OmniOpt/OmniOpt/.ax.py", line 907, in generation_strategy_gen
return gs.gen(experiment=experiment, n=n)
File "/home/runner/.omniax_venvs/Python_3.10.12/x86_64/lib/python3.10/site-packages/ax/generation_strategy/generation_strategy.py", line 376, in gen
self._gen_with_multiple_nodes(
File "/home/runner/.omniax_venvs/Python_3.10.12/x86_64/lib/python3.10/site-packages/ax/generation_strategy/generation_strategy.py", line 728, in _gen_with_multiple_nodes
gr = self._curr.gen(
File "/home/runner/.omniax_venvs/Python_3.10.12/x86_64/lib/python3.10/site-packages/ax/generation_strategy/generation_node.py", line 447, in gen
gr = self._try_gen_with_fallback(
File "/home/runner/.omniax_venvs/Python_3.10.12/x86_64/lib/python3.10/site-packages/ax/generation_strategy/generation_node.py", line 587, in _try_gen_with_fallback
gr = self._gen(
File "/home/runner/.omniax_venvs/Python_3.10.12/x86_64/lib/python3.10/site-packages/ax/generation_strategy/generation_node.py", line 500, in _gen
return generator_spec.gen(
File "/home/runner/.omniax_venvs/Python_3.10.12/x86_64/lib/python3.10/site-packages/ax/generation_strategy/generator_spec.py", line 231, in gen
generator_run = fitted_adapter.gen(**model_gen_kwargs)
File "/home/runner/.omniax_venvs/Python_3.10.12/x86_64/lib/python3.10/site-packages/ax/adapter/base.py", line 833, in gen
gen_results = self._gen(
File "/home/runner/.omniax_venvs/Python_3.10.12/x86_64/lib/python3.10/site-packages/ax/adapter/random.py", line 127, in _gen
X, w = self.generator.gen(
File "/home/runner/.omniax_venvs/Python_3.10.12/x86_64/lib/python3.10/site-packages/ax/generators/random/sobol.py", line 116, in gen
points, weights = super().gen(
File "/home/runner/.omniax_venvs/Python_3.10.12/x86_64/lib/python3.10/site-packages/ax/generators/random/base.py", line 237, in gen
points, _ = rejection_sample(
File "/home/runner/.omniax_venvs/Python_3.10.12/x86_64/lib/python3.10/site-packages/ax/generators/utils.py", line 151, in rejection_sample
raise SearchSpaceExhausted(
ax.exceptions.core.SearchSpaceExhausted: Rejection sampling error (specified maximum draws (10000) exhausted, without finding sufficiently many (1) candidates). This likely means that there are no new points left in the search space.
The above exception was the direct cause of the following exception:
Traceback (most recent call last):
File "/home/runner/work/OmniOpt/OmniOpt/./omniopt", line 12557, in get_batched_arms
batched_generator_run: Any = ax_backend.generation_strategy_gen(
File "/home/runner/work/OmniOpt/OmniOpt/.ax.py", line 914, in generation_strategy_gen
raise translated from exc
ax_backend.SearchSpaceExhausted: Rejection sampling error (specified maximum draws (10000) exhausted, without finding sufficiently many (1) candidates). This likely means that there are no new points left in the search space.
[omniopt] Only 0/1 unique points could be generated (retries=20/20, node=BOTORCH_MODULAR, duplicates=19, constraints=0, empty_batches=1). Details: /home/runner/work/OmniOpt/OmniOpt/runs/test_wronggoing_stuff/0/generation_debug.csv[omniopt] Only 0/1 unique points could be generated (retries=20/20, node=BOTORCH_MODULAR, duplicates=20, constraints=0, empty_batches=0). Details: /home/runner/work/OmniOpt/OmniOpt/runs/test_wronggoing_stuff/0/generation_debug.csv[omniopt] Only 0/1 unique points could be generated (retries=20/20, node=BOTORCH_MODULAR, duplicates=20, constraints=0, empty_batches=0). Details: /home/runner/work/OmniOpt/OmniOpt/runs/test_wronggoing_stuff/0/generation_debug.csv[omniopt] Only 0/1 unique points could be generated (retries=20/20, node=BOTORCH_MODULAR, duplicates=20, constraints=0, empty_batches=0). Details: /home/runner/work/OmniOpt/OmniOpt/runs/test_wronggoing_stuff/0/generation_debug.csv[omniopt] Only 0/1 unique points could be generated (retries=20/20, node=BOTORCH_MODULAR, duplicates=20, constraints=0, empty_batches=0). Details: /home/runner/work/OmniOpt/OmniOpt/runs/test_wronggoing_stuff/0/generation_debug.csv
Traceback (most recent call last):
File "/home/runner/.omniax_venvs/Python_3.10.12/x86_64/lib/python3.10/site-packages/ax/generation_strategy/generation_node.py", line 440, in gen
gr = self._gen_maybe_deduplicate(
File "/home/runner/.omniax_venvs/Python_3.10.12/x86_64/lib/python3.10/site-packages/ax/generation_strategy/generation_node.py", line 549, in _gen_maybe_deduplicate
raise GenerationStrategyRepeatedPoints(MAX_GEN_ATTEMPTS_EXCEEDED_MESSAGE)
ax.exceptions.generation_strategy.GenerationStrategyRepeatedPoints: GenerationStrategy exceeded `MAX_GEN_ATTEMPTS` of 5 while trying to generate a unique parameterization. This indicates that the search space has likely been fully explored, or that the sweep has converged.
During handling of the above exception, another exception occurred:
Traceback (most recent call last):
File "/home/runner/.omniax_venvs/Python_3.10.12/x86_64/lib/python3.10/site-packages/ax/generators/random/base.py", line 177, in gen
points, attempted_draws = rejection_sample(
File "/home/runner/.omniax_venvs/Python_3.10.12/x86_64/lib/python3.10/site-packages/ax/generators/utils.py", line 151, in rejection_sample
raise SearchSpaceExhausted(
ax.exceptions.core.SearchSpaceExhausted: Rejection sampling error (specified maximum draws (10000) exhausted, without finding sufficiently many (1) candidates). This likely means that there are no new points left in the search space.
During handling of the above exception, another exception occurred:
Traceback (most recent call last):
File "/home/runner/work/OmniOpt/OmniOpt/.ax.py", line 907, in generation_strategy_gen
return gs.gen(experiment=experiment, n=n)
File "/home/runner/.omniax_venvs/Python_3.10.12/x86_64/lib/python3.10/site-packages/ax/generation_strategy/generation_strategy.py", line 376, in gen
self._gen_with_multiple_nodes(
File "/home/runner/.omniax_venvs/Python_3.10.12/x86_64/lib/python3.10/site-packages/ax/generation_strategy/generation_strategy.py", line 728, in _gen_with_multiple_nodes
gr = self._curr.gen(
File "/home/runner/.omniax_venvs/Python_3.10.12/x86_64/lib/python3.10/site-packages/ax/generation_strategy/generation_node.py", line 447, in gen
gr = self._try_gen_with_fallback(
File "/home/runner/.omniax_venvs/Python_3.10.12/x86_64/lib/python3.10/site-packages/ax/generation_strategy/generation_node.py", line 587, in _try_gen_with_fallback
gr = self._gen(
File "/home/runner/.omniax_venvs/Python_3.10.12/x86_64/lib/python3.10/site-packages/ax/generation_strategy/generation_node.py", line 500, in _gen
return generator_spec.gen(
File "/home/runner/.omniax_venvs/Python_3.10.12/x86_64/lib/python3.10/site-packages/ax/generation_strategy/generator_spec.py", line 231, in gen
generator_run = fitted_adapter.gen(**model_gen_kwargs)
File "/home/runner/.omniax_venvs/Python_3.10.12/x86_64/lib/python3.10/site-packages/ax/adapter/base.py", line 833, in gen
gen_results = self._gen(
File "/home/runner/.omniax_venvs/Python_3.10.12/x86_64/lib/python3.10/site-packages/ax/adapter/random.py", line 127, in _gen
X, w = self.generator.gen(
File "/home/runner/.omniax_venvs/Python_3.10.12/x86_64/lib/python3.10/site-packages/ax/generators/random/sobol.py", line 116, in gen
points, weights = super().gen(
File "/home/runner/.omniax_venvs/Python_3.10.12/x86_64/lib/python3.10/site-packages/ax/generators/random/base.py", line 237, in gen
points, _ = rejection_sample(
File "/home/runner/.omniax_venvs/Python_3.10.12/x86_64/lib/python3.10/site-packages/ax/generators/utils.py", line 151, in rejection_sample
raise SearchSpaceExhausted(
ax.exceptions.core.SearchSpaceExhausted: Rejection sampling error (specified maximum draws (10000) exhausted, without finding sufficiently many (1) candidates). This likely means that there are no new points left in the search space.
The above exception was the direct cause of the following exception:
Traceback (most recent call last):
File "/home/runner/work/OmniOpt/OmniOpt/./omniopt", line 12557, in get_batched_arms
batched_generator_run: Any = ax_backend.generation_strategy_gen(
File "/home/runner/work/OmniOpt/OmniOpt/.ax.py", line 914, in generation_strategy_gen
raise translated from exc
ax_backend.SearchSpaceExhausted: Rejection sampling error (specified maximum draws (10000) exhausted, without finding sufficiently many (1) candidates). This likely means that there are no new points left in the search space.
Traceback (most recent call last):
File "/home/runner/.omniax_venvs/Python_3.10.12/x86_64/lib/python3.10/site-packages/ax/generation_strategy/generation_node.py", line 440, in gen
gr = self._gen_maybe_deduplicate(
File "/home/runner/.omniax_venvs/Python_3.10.12/x86_64/lib/python3.10/site-packages/ax/generation_strategy/generation_node.py", line 549, in _gen_maybe_deduplicate
raise GenerationStrategyRepeatedPoints(MAX_GEN_ATTEMPTS_EXCEEDED_MESSAGE)
ax.exceptions.generation_strategy.GenerationStrategyRepeatedPoints: GenerationStrategy exceeded `MAX_GEN_ATTEMPTS` of 5 while trying to generate a unique parameterization. This indicates that the search space has likely been fully explored, or that the sweep has converged.
During handling of the above exception, another exception occurred:
Traceback (most recent call last):
File "/home/runner/.omniax_venvs/Python_3.10.12/x86_64/lib/python3.10/site-packages/ax/generators/random/base.py", line 177, in gen
points, attempted_draws = rejection_sample(
File "/home/runner/.omniax_venvs/Python_3.10.12/x86_64/lib/python3.10/site-packages/ax/generators/utils.py", line 151, in rejection_sample
raise SearchSpaceExhausted(
ax.exceptions.core.SearchSpaceExhausted: Rejection sampling error (specified maximum draws (10000) exhausted, without finding sufficiently many (1) candidates). This likely means that there are no new points left in the search space.
During handling of the above exception, another exception occurred:
Traceback (most recent call last):
File "/home/runner/work/OmniOpt/OmniOpt/.ax.py", line 907, in generation_strategy_gen
return gs.gen(experiment=experiment, n=n)
File "/home/runner/.omniax_venvs/Python_3.10.12/x86_64/lib/python3.10/site-packages/ax/generation_strategy/generation_strategy.py", line 376, in gen
self._gen_with_multiple_nodes(
File "/home/runner/.omniax_venvs/Python_3.10.12/x86_64/lib/python3.10/site-packages/ax/generation_strategy/generation_strategy.py", line 728, in _gen_with_multiple_nodes
gr = self._curr.gen(
File "/home/runner/.omniax_venvs/Python_3.10.12/x86_64/lib/python3.10/site-packages/ax/generation_strategy/generation_node.py", line 447, in gen
gr = self._try_gen_with_fallback(
File "/home/runner/.omniax_venvs/Python_3.10.12/x86_64/lib/python3.10/site-packages/ax/generation_strategy/generation_node.py", line 587, in _try_gen_with_fallback
gr = self._gen(
File "/home/runner/.omniax_venvs/Python_3.10.12/x86_64/lib/python3.10/site-packages/ax/generation_strategy/generation_node.py", line 500, in _gen
return generator_spec.gen(
File "/home/runner/.omniax_venvs/Python_3.10.12/x86_64/lib/python3.10/site-packages/ax/generation_strategy/generator_spec.py", line 231, in gen
generator_run = fitted_adapter.gen(**model_gen_kwargs)
File "/home/runner/.omniax_venvs/Python_3.10.12/x86_64/lib/python3.10/site-packages/ax/adapter/base.py", line 833, in gen
gen_results = self._gen(
File "/home/runner/.omniax_venvs/Python_3.10.12/x86_64/lib/python3.10/site-packages/ax/adapter/random.py", line 127, in _gen
X, w = self.generator.gen(
File "/home/runner/.omniax_venvs/Python_3.10.12/x86_64/lib/python3.10/site-packages/ax/generators/random/sobol.py", line 116, in gen
points, weights = super().gen(
File "/home/runner/.omniax_venvs/Python_3.10.12/x86_64/lib/python3.10/site-packages/ax/generators/random/base.py", line 237, in gen
points, _ = rejection_sample(
File "/home/runner/.omniax_venvs/Python_3.10.12/x86_64/lib/python3.10/site-packages/ax/generators/utils.py", line 151, in rejection_sample
raise SearchSpaceExhausted(
ax.exceptions.core.SearchSpaceExhausted: Rejection sampling error (specified maximum draws (10000) exhausted, without finding sufficiently many (1) candidates). This likely means that there are no new points left in the search space.
The above exception was the direct cause of the following exception:
Traceback (most recent call last):
File "/home/runner/work/OmniOpt/OmniOpt/./omniopt", line 12557, in get_batched_arms
batched_generator_run: Any = ax_backend.generation_strategy_gen(
File "/home/runner/work/OmniOpt/OmniOpt/.ax.py", line 914, in generation_strategy_gen
raise translated from exc
ax_backend.SearchSpaceExhausted: Rejection sampling error (specified maximum draws (10000) exhausted, without finding sufficiently many (1) candidates). This likely means that there are no new points left in the search space.
Traceback (most recent call last):
File "/home/runner/.omniax_venvs/Python_3.10.12/x86_64/lib/python3.10/site-packages/ax/generation_strategy/generation_node.py", line 440, in gen
gr = self._gen_maybe_deduplicate(
File "/home/runner/.omniax_venvs/Python_3.10.12/x86_64/lib/python3.10/site-packages/ax/generation_strategy/generation_node.py", line 549, in _gen_maybe_deduplicate
raise GenerationStrategyRepeatedPoints(MAX_GEN_ATTEMPTS_EXCEEDED_MESSAGE)
ax.exceptions.generation_strategy.GenerationStrategyRepeatedPoints: GenerationStrategy exceeded `MAX_GEN_ATTEMPTS` of 5 while trying to generate a unique parameterization. This indicates that the search space has likely been fully explored, or that the sweep has converged.
During handling of the above exception, another exception occurred:
Traceback (most recent call last):
File "/home/runner/.omniax_venvs/Python_3.10.12/x86_64/lib/python3.10/site-packages/ax/generators/random/base.py", line 177, in gen
points, attempted_draws = rejection_sample(
File "/home/runner/.omniax_venvs/Python_3.10.12/x86_64/lib/python3.10/site-packages/ax/generators/utils.py", line 151, in rejection_sample
raise SearchSpaceExhausted(
ax.exceptions.core.SearchSpaceExhausted: Rejection sampling error (specified maximum draws (10000) exhausted, without finding sufficiently many (1) candidates). This likely means that there are no new points left in the search space.
During handling of the above exception, another exception occurred:
Traceback (most recent call last):
File "/home/runner/work/OmniOpt/OmniOpt/.ax.py", line 907, in generation_strategy_gen
return gs.gen(experiment=experiment, n=n)
File "/home/runner/.omniax_venvs/Python_3.10.12/x86_64/lib/python3.10/site-packages/ax/generation_strategy/generation_strategy.py", line 376, in gen
self._gen_with_multiple_nodes(
File "/home/runner/.omniax_venvs/Python_3.10.12/x86_64/lib/python3.10/site-packages/ax/generation_strategy/generation_strategy.py", line 728, in _gen_with_multiple_nodes
gr = self._curr.gen(
File "/home/runner/.omniax_venvs/Python_3.10.12/x86_64/lib/python3.10/site-packages/ax/generation_strategy/generation_node.py", line 447, in gen
gr = self._try_gen_with_fallback(
File "/home/runner/.omniax_venvs/Python_3.10.12/x86_64/lib/python3.10/site-packages/ax/generation_strategy/generation_node.py", line 587, in _try_gen_with_fallback
gr = self._gen(
File "/home/runner/.omniax_venvs/Python_3.10.12/x86_64/lib/python3.10/site-packages/ax/generation_strategy/generation_node.py", line 500, in _gen
return generator_spec.gen(
File "/home/runner/.omniax_venvs/Python_3.10.12/x86_64/lib/python3.10/site-packages/ax/generation_strategy/generator_spec.py", line 231, in gen
generator_run = fitted_adapter.gen(**model_gen_kwargs)
File "/home/runner/.omniax_venvs/Python_3.10.12/x86_64/lib/python3.10/site-packages/ax/adapter/base.py", line 833, in gen
gen_results = self._gen(
File "/home/runner/.omniax_venvs/Python_3.10.12/x86_64/lib/python3.10/site-packages/ax/adapter/random.py", line 127, in _gen
X, w = self.generator.gen(
File "/home/runner/.omniax_venvs/Python_3.10.12/x86_64/lib/python3.10/site-packages/ax/generators/random/sobol.py", line 116, in gen
points, weights = super().gen(
File "/home/runner/.omniax_venvs/Python_3.10.12/x86_64/lib/python3.10/site-packages/ax/generators/random/base.py", line 237, in gen
points, _ = rejection_sample(
File "/home/runner/.omniax_venvs/Python_3.10.12/x86_64/lib/python3.10/site-packages/ax/generators/utils.py", line 151, in rejection_sample
raise SearchSpaceExhausted(
ax.exceptions.core.SearchSpaceExhausted: Rejection sampling error (specified maximum draws (10000) exhausted, without finding sufficiently many (1) candidates). This likely means that there are no new points left in the search space.
The above exception was the direct cause of the following exception:
Traceback (most recent call last):
File "/home/runner/work/OmniOpt/OmniOpt/./omniopt", line 12557, in get_batched_arms
batched_generator_run: Any = ax_backend.generation_strategy_gen(
File "/home/runner/work/OmniOpt/OmniOpt/.ax.py", line 914, in generation_strategy_gen
raise translated from exc
ax_backend.SearchSpaceExhausted: Rejection sampling error (specified maximum draws (10000) exhausted, without finding sufficiently many (1) candidates). This likely means that there are no new points left in the search space.
Traceback (most recent call last):
File "/home/runner/.omniax_venvs/Python_3.10.12/x86_64/lib/python3.10/site-packages/ax/generation_strategy/generation_node.py", line 440, in gen
gr = self._gen_maybe_deduplicate(
File "/home/runner/.omniax_venvs/Python_3.10.12/x86_64/lib/python3.10/site-packages/ax/generation_strategy/generation_node.py", line 549, in _gen_maybe_deduplicate
raise GenerationStrategyRepeatedPoints(MAX_GEN_ATTEMPTS_EXCEEDED_MESSAGE)
ax.exceptions.generation_strategy.GenerationStrategyRepeatedPoints: GenerationStrategy exceeded `MAX_GEN_ATTEMPTS` of 5 while trying to generate a unique parameterization. This indicates that the search space has likely been fully explored, or that the sweep has converged.
During handling of the above exception, another exception occurred:
Traceback (most recent call last):
File "/home/runner/.omniax_venvs/Python_3.10.12/x86_64/lib/python3.10/site-packages/ax/generators/random/base.py", line 177, in gen
points, attempted_draws = rejection_sample(
File "/home/runner/.omniax_venvs/Python_3.10.12/x86_64/lib/python3.10/site-packages/ax/generators/utils.py", line 151, in rejection_sample
raise SearchSpaceExhausted(
ax.exceptions.core.SearchSpaceExhausted: Rejection sampling error (specified maximum draws (10000) exhausted, without finding sufficiently many (1) candidates). This likely means that there are no new points left in the search space.
During handling of the above exception, another exception occurred:
Traceback (most recent call last):
File "/home/runner/work/OmniOpt/OmniOpt/.ax.py", line 907, in generation_strategy_gen
return gs.gen(experiment=experiment, n=n)
File "/home/runner/.omniax_venvs/Python_3.10.12/x86_64/lib/python3.10/site-packages/ax/generation_strategy/generation_strategy.py", line 376, in gen
self._gen_with_multiple_nodes(
File "/home/runner/.omniax_venvs/Python_3.10.12/x86_64/lib/python3.10/site-packages/ax/generation_strategy/generation_strategy.py", line 728, in _gen_with_multiple_nodes
gr = self._curr.gen(
File "/home/runner/.omniax_venvs/Python_3.10.12/x86_64/lib/python3.10/site-packages/ax/generation_strategy/generation_node.py", line 447, in gen
gr = self._try_gen_with_fallback(
File "/home/runner/.omniax_venvs/Python_3.10.12/x86_64/lib/python3.10/site-packages/ax/generation_strategy/generation_node.py", line 587, in _try_gen_with_fallback
gr = self._gen(
File "/home/runner/.omniax_venvs/Python_3.10.12/x86_64/lib/python3.10/site-packages/ax/generation_strategy/generation_node.py", line 500, in _gen
return generator_spec.gen(
File "/home/runner/.omniax_venvs/Python_3.10.12/x86_64/lib/python3.10/site-packages/ax/generation_strategy/generator_spec.py", line 231, in gen
generator_run = fitted_adapter.gen(**model_gen_kwargs)
File "/home/runner/.omniax_venvs/Python_3.10.12/x86_64/lib/python3.10/site-packages/ax/adapter/base.py", line 833, in gen
gen_results = self._gen(
File "/home/runner/.omniax_venvs/Python_3.10.12/x86_64/lib/python3.10/site-packages/ax/adapter/random.py", line 127, in _gen
X, w = self.generator.gen(
File "/home/runner/.omniax_venvs/Python_3.10.12/x86_64/lib/python3.10/site-packages/ax/generators/random/sobol.py", line 116, in gen
points, weights = super().gen(
File "/home/runner/.omniax_venvs/Python_3.10.12/x86_64/lib/python3.10/site-packages/ax/generators/random/base.py", line 237, in gen
points, _ = rejection_sample(
File "/home/runner/.omniax_venvs/Python_3.10.12/x86_64/lib/python3.10/site-packages/ax/generators/utils.py", line 151, in rejection_sample
raise SearchSpaceExhausted(
ax.exceptions.core.SearchSpaceExhausted: Rejection sampling error (specified maximum draws (10000) exhausted, without finding sufficiently many (1) candidates). This likely means that there are no new points left in the search space.
The above exception was the direct cause of the following exception:
Traceback (most recent call last):
File "/home/runner/work/OmniOpt/OmniOpt/./omniopt", line 12557, in get_batched_arms
batched_generator_run: Any = ax_backend.generation_strategy_gen(
File "/home/runner/work/OmniOpt/OmniOpt/.ax.py", line 914, in generation_strategy_gen
raise translated from exc
ax_backend.SearchSpaceExhausted: Rejection sampling error (specified maximum draws (10000) exhausted, without finding sufficiently many (1) candidates). This likely means that there are no new points left in the search space.
[omniopt] Only 0/1 unique points could be generated (retries=20/20, node=BOTORCH_MODULAR, duplicates=16, constraints=0, empty_batches=4). Details: /home/runner/work/OmniOpt/OmniOpt/runs/test_wronggoing_stuff/0/generation_debug.csv[omniopt] Only 0/1 unique points could be generated (retries=20/20, node=BOTORCH_MODULAR, duplicates=20, constraints=0, empty_batches=0). Details: /home/runner/work/OmniOpt/OmniOpt/runs/test_wronggoing_stuff/0/generation_debug.csvFailed Jobs parameters
┏━━━━━━━━┳━━━━━━━━┳━━━━━━━━┳━━━━━━━━━━━━━━━━━━━━━━━━━━━━━━━━━━━━━━━━━━━━━━━━━━━┓
┃param1┃param2┃param3┃error_description ┃
┡━━━━━━━━╇━━━━━━━━╇━━━━━━━━╇━━━━━━━━━━━━━━━━━━━━━━━━━━━━━━━━━━━━━━━━━━━━━━━━━━━┩
│value1│value2│value3│Some error occurred during execution (this is not│
││││a real error!). │
└────────┴────────┴────────┴───────────────────────────────────────────────────┘
Best RESULT, min (total: 5, failed: 18)
┏━━━━━━━━━┳━━━━━━━━━━━━━━┓
┃program┃RESULT ┃
┡━━━━━━━━━╇━━━━━━━━━━━━━━┩
│perl │0.5187926007│
└─────────┴──────────────┘
Not printing sixel graphics in CI
Runtime Infos
┏━━━━━━━━━━━━━━━━━━━━━━━┳━━━━━━━━━━━┳━━━━━━━━━━━━┳━━━━━━━━━━━━━━┳━━━━━━━━━━━━━┓
┃Number of evaluations┃Min time ┃ Max time ┃Average time┃Median time┃
┡━━━━━━━━━━━━━━━━━━━━━━━╇━━━━━━━━━━━╇━━━━━━━━━━━━╇━━━━━━━━━━━━━━╇━━━━━━━━━━━━━┩
│ 23 │ 0.00 sec │ 12.00 sec │ 6.00 sec │ 6.00 sec │
└───────────────────────┴───────────┴────────────┴──────────────┴─────────────┘
╭────────────────────────────OmniOpt2 Run Summary────────────────────────────╮│││ ⚠️ Optimization finished with some failures││││ 📊 Trials: 5 succeeded / 18 failed / 5 done / 23 submitted ││ ⏱️ Duration: 623s (10m23s) ││ 🏆 Best RESULT: 0.5187926007 ││ 📁 Results: /home/runner/work/OmniOpt/OmniOpt/runs/test_wronggoing_stuff││ 🤖 Model: BOTORCH_MODULAR │││╰──────────────────────────────────────────────────────────────────────────────╯
2026-10-30 14:56:20 (2d0f6459-544d-4362-8636-fadf95df3bea): SOBOL, Started OmniOpt2 run...
2026-10-30 14:56:20 (2d0f6459-544d-4362-8636-fadf95df3bea): SOBOL, getting new HP set (no sbatch)
2026-10-30 14:56:20 (2d0f6459-544d-4362-8636-fadf95df3bea): SOBOL, requested 1 jobs, got 1, 0.03 s/job
2026-10-30 14:56:20 (2d0f6459-544d-4362-8636-fadf95df3bea): SOBOL, eval #1/1 start
2026-10-30 14:56:20 (2d0f6459-544d-4362-8636-fadf95df3bea): SOBOL, starting new job
2026-10-30 14:56:21 (2d0f6459-544d-4362-8636-fadf95df3bea): SOBOL, started new job
2026-10-30 14:56:31 (2d0f6459-544d-4362-8636-fadf95df3bea): SOBOL, job_failed
2026-10-30 14:56:31 (2d0f6459-544d-4362-8636-fadf95df3bea): SOBOL, failed: 1 ('RESULT: <FLOAT>' not found), finishing jobs (get_next_trials), finished 1 job
2026-10-30 14:56:31 (2d0f6459-544d-4362-8636-fadf95df3bea): SOBOL, failed: 1 ('RESULT: <FLOAT>' not found), getting new HP set (no sbatch)
2026-10-30 14:56:31 (2d0f6459-544d-4362-8636-fadf95df3bea): SOBOL, failed: 1 ('RESULT: <FLOAT>' not found), requested 1 jobs, got 1, 0.05 s/job
2026-10-30 14:56:31 (2d0f6459-544d-4362-8636-fadf95df3bea): SOBOL, failed: 1 ('RESULT: <FLOAT>' not found), eval #1/1 start
2026-10-30 14:56:31 (2d0f6459-544d-4362-8636-fadf95df3bea): SOBOL, failed: 1 ('RESULT: <FLOAT>' not found), starting new job
2026-10-30 14:56:31 (2d0f6459-544d-4362-8636-fadf95df3bea): SOBOL, failed: 1 ('RESULT: <FLOAT>' not found), started new job
2026-10-30 14:56:41 (2d0f6459-544d-4362-8636-fadf95df3bea): SOBOL, failed: 1 ('RESULT: <FLOAT>' not found), new result: RESULT: 0.518793
2026-10-30 14:56:42 (2d0f6459-544d-4362-8636-fadf95df3bea): SOBOL, failed: 1 ('RESULT: <FLOAT>' not found), best RESULT: 0.518792600677447, finishing jobs (get_next_trials), finished 1 job
2026-10-30 14:56:43 (2d0f6459-544d-4362-8636-fadf95df3bea): BOTORCH_MODULAR, failed: 1 ('RESULT: <FLOAT>' not found), best RESULT: 0.518792600677447, getting new HP set (no sbatch)
2026-10-30 14:56:43 (2d0f6459-544d-4362-8636-fadf95df3bea): BOTORCH_MODULAR, failed: 1 ('RESULT: <FLOAT>' not found), best RESULT: 0.518792600677447, requested 1 jobs, got 1, 0.29 s/job
2026-10-30 14:56:43 (2d0f6459-544d-4362-8636-fadf95df3bea): BOTORCH_MODULAR, failed: 1 ('RESULT: <FLOAT>' not found), best RESULT: 0.518792600677447, eval #1/1 start
2026-10-30 14:56:43 (2d0f6459-544d-4362-8636-fadf95df3bea): BOTORCH_MODULAR, failed: 1 ('RESULT: <FLOAT>' not found), best RESULT: 0.518792600677447, starting new job
2026-10-30 14:56:43 (2d0f6459-544d-4362-8636-fadf95df3bea): BOTORCH_MODULAR, failed: 1 ('RESULT: <FLOAT>' not found), best RESULT: 0.518792600677447, started new job
2026-10-30 14:56:53 (2d0f6459-544d-4362-8636-fadf95df3bea): BOTORCH_MODULAR, failed: 1 ('RESULT: <FLOAT>' not found), best RESULT: 0.518792600677447, job_failed
2026-10-30 14:56:53 (2d0f6459-544d-4362-8636-fadf95df3bea): BOTORCH_MODULAR, failed: 2 ('RESULT: <FLOAT>' not found), best RESULT: 0.5187926007, finishing jobs (get_next_trials), finished 1 job
2026-10-30 14:56:53 (2d0f6459-544d-4362-8636-fadf95df3bea): BOTORCH_MODULAR, failed: 2 ('RESULT: <FLOAT>' not found), best RESULT: 0.5187926007, getting new HP set (no sbatch)
2026-10-30 14:56:53 (2d0f6459-544d-4362-8636-fadf95df3bea): BOTORCH_MODULAR, failed: 2 ('RESULT: <FLOAT>' not found), best RESULT: 0.5187926007, requested 1 jobs, got 1, 0.23 s/job
2026-10-30 14:56:53 (2d0f6459-544d-4362-8636-fadf95df3bea): BOTORCH_MODULAR, failed: 2 ('RESULT: <FLOAT>' not found), best RESULT: 0.5187926007, eval #1/1 start
2026-10-30 14:56:53 (2d0f6459-544d-4362-8636-fadf95df3bea): BOTORCH_MODULAR, failed: 2 ('RESULT: <FLOAT>' not found), best RESULT: 0.5187926007, starting new job
2026-10-30 14:56:53 (2d0f6459-544d-4362-8636-fadf95df3bea): BOTORCH_MODULAR, failed: 2 ('RESULT: <FLOAT>' not found), best RESULT: 0.5187926007, started new job
2026-10-30 14:57:02 (2d0f6459-544d-4362-8636-fadf95df3bea): BOTORCH_MODULAR, failed: 2 ('RESULT: <FLOAT>' not found), best RESULT: 0.5187926007, job_failed
2026-10-30 14:57:02 (2d0f6459-544d-4362-8636-fadf95df3bea): BOTORCH_MODULAR, failed: 3 ('RESULT: <FLOAT>' not found), best RESULT: 0.5187926007, finishing jobs (get_next_trials), finished 1 job
2026-10-30 14:57:03 (2d0f6459-544d-4362-8636-fadf95df3bea): BOTORCH_MODULAR, failed: 3 ('RESULT: <FLOAT>' not found), best RESULT: 0.5187926007, getting new HP set (no sbatch)
2026-10-30 14:57:03 (2d0f6459-544d-4362-8636-fadf95df3bea): BOTORCH_MODULAR, failed: 3 ('RESULT: <FLOAT>' not found), best RESULT: 0.5187926007, requested 1 jobs, got 1, 0.22 s/job
2026-10-30 14:57:03 (2d0f6459-544d-4362-8636-fadf95df3bea): BOTORCH_MODULAR, failed: 3 ('RESULT: <FLOAT>' not found), best RESULT: 0.5187926007, eval #1/1 start
2026-10-30 14:57:03 (2d0f6459-544d-4362-8636-fadf95df3bea): BOTORCH_MODULAR, failed: 3 ('RESULT: <FLOAT>' not found), best RESULT: 0.5187926007, starting new job
2026-10-30 14:57:03 (2d0f6459-544d-4362-8636-fadf95df3bea): BOTORCH_MODULAR, failed: 3 ('RESULT: <FLOAT>' not found), best RESULT: 0.5187926007, started new job
2026-10-30 14:57:12 (2d0f6459-544d-4362-8636-fadf95df3bea): BOTORCH_MODULAR, failed: 3 ('RESULT: <FLOAT>' not found), best RESULT: 0.5187926007, new result: RESULT: 536249818.000000
2026-10-30 14:57:13 (2d0f6459-544d-4362-8636-fadf95df3bea): BOTORCH_MODULAR, failed: 3 ('RESULT: <FLOAT>' not found), best RESULT: 0.5187926007, █▁, finishing jobs (get_next_trials), finished 1 job
2026-10-30 14:57:14 (2d0f6459-544d-4362-8636-fadf95df3bea): BOTORCH_MODULAR, failed: 3 ('RESULT: <FLOAT>' not found), best RESULT: 0.5187926007, █▁, getting new HP set (no sbatch)
2026-10-30 14:57:14 (2d0f6459-544d-4362-8636-fadf95df3bea): BOTORCH_MODULAR, failed: 3 ('RESULT: <FLOAT>' not found), best RESULT: 0.5187926007, █▁, requested 1 jobs, got 1, 1.03 s/job
2026-10-30 14:57:14 (2d0f6459-544d-4362-8636-fadf95df3bea): BOTORCH_MODULAR, failed: 3 ('RESULT: <FLOAT>' not found), best RESULT: 0.5187926007, █▁, eval #1/1 start
2026-10-30 14:57:14 (2d0f6459-544d-4362-8636-fadf95df3bea): BOTORCH_MODULAR, failed: 3 ('RESULT: <FLOAT>' not found), best RESULT: 0.5187926007, █▁, starting new job
2026-10-30 14:57:14 (2d0f6459-544d-4362-8636-fadf95df3bea): BOTORCH_MODULAR, failed: 3 ('RESULT: <FLOAT>' not found), best RESULT: 0.5187926007, █▁, started new job
2026-10-30 14:57:23 (2d0f6459-544d-4362-8636-fadf95df3bea): BOTORCH_MODULAR, failed: 3 ('RESULT: <FLOAT>' not found), best RESULT: 0.5187926007, █▁, new result: RESULT: 1955307364.000000
2026-10-30 14:57:24 (2d0f6459-544d-4362-8636-fadf95df3bea): BOTORCH_MODULAR, failed: 3 ('RESULT: <FLOAT>' not found), best RESULT: 0.5187926007, █▆▁, finishing jobs (get_next_trials), finished 1 job
2026-10-30 14:57:25 (2d0f6459-544d-4362-8636-fadf95df3bea): BOTORCH_MODULAR, failed: 3 ('RESULT: <FLOAT>' not found), best RESULT: 0.5187926007, █▆▁, getting new HP set (no sbatch)
2026-10-30 14:57:25 (2d0f6459-544d-4362-8636-fadf95df3bea): BOTORCH_MODULAR, failed: 3 ('RESULT: <FLOAT>' not found), best RESULT: 0.5187926007, █▆▁, requested 1 jobs, got 1, 1.09 s/job
2026-10-30 14:57:25 (2d0f6459-544d-4362-8636-fadf95df3bea): BOTORCH_MODULAR, failed: 3 ('RESULT: <FLOAT>' not found), best RESULT: 0.5187926007, █▆▁, eval #1/1 start
2026-10-30 14:57:25 (2d0f6459-544d-4362-8636-fadf95df3bea): BOTORCH_MODULAR, failed: 3 ('RESULT: <FLOAT>' not found), best RESULT: 0.5187926007, █▆▁, starting new job
2026-10-30 14:57:25 (2d0f6459-544d-4362-8636-fadf95df3bea): BOTORCH_MODULAR, failed: 3 ('RESULT: <FLOAT>' not found), best RESULT: 0.5187926007, █▆▁, started new job
2026-10-30 14:57:40 (2d0f6459-544d-4362-8636-fadf95df3bea): BOTORCH_MODULAR, failed: 3 ('RESULT: <FLOAT>' not found), best RESULT: 0.5187926007, █▆▁, new result: RESULT: 1234.000000
2026-10-30 14:57:41 (2d0f6459-544d-4362-8636-fadf95df3bea): BOTORCH_MODULAR, failed: 3 ('RESULT: <FLOAT>' not found), best RESULT: 0.5187926007, █▆▁▇, finishing jobs (get_next_trials), finished 1 job
2026-10-30 14:57:42 (2d0f6459-544d-4362-8636-fadf95df3bea): BOTORCH_MODULAR, failed: 3 ('RESULT: <FLOAT>' not found), best RESULT: 0.5187926007, █▆▁▇, getting new HP set (no sbatch)
2026-10-30 14:57:42 (2d0f6459-544d-4362-8636-fadf95df3bea): BOTORCH_MODULAR, failed: 3 ('RESULT: <FLOAT>' not found), best RESULT: 0.5187926007, █▆▁▇, requested 1 jobs, got 1, 1.25 s/job
2026-10-30 14:57:42 (2d0f6459-544d-4362-8636-fadf95df3bea): BOTORCH_MODULAR, failed: 3 ('RESULT: <FLOAT>' not found), best RESULT: 0.5187926007, █▆▁▇, eval #1/1 start
2026-10-30 14:57:42 (2d0f6459-544d-4362-8636-fadf95df3bea): BOTORCH_MODULAR, failed: 3 ('RESULT: <FLOAT>' not found), best RESULT: 0.5187926007, █▆▁▇, starting new job
2026-10-30 14:57:42 (2d0f6459-544d-4362-8636-fadf95df3bea): BOTORCH_MODULAR, failed: 3 ('RESULT: <FLOAT>' not found), best RESULT: 0.5187926007, █▆▁▇, started new job
2026-10-30 14:57:51 (2d0f6459-544d-4362-8636-fadf95df3bea): BOTORCH_MODULAR, failed: 3 ('RESULT: <FLOAT>' not found), best RESULT: 0.5187926007, █▆▁▇, job_failed
2026-10-30 14:57:51 (2d0f6459-544d-4362-8636-fadf95df3bea): BOTORCH_MODULAR, failed: 4 ('RESULT: <FLOAT>' not found), best RESULT: 0.5187926007, █▆▁▇, finishing jobs (get_next_trials), finished 1 job
2026-10-30 14:57:53 (2d0f6459-544d-4362-8636-fadf95df3bea): BOTORCH_MODULAR, failed: 4 ('RESULT: <FLOAT>' not found), best RESULT: 0.5187926007, █▆▁▇, getting new HP set (no sbatch)
2026-10-30 14:57:53 (2d0f6459-544d-4362-8636-fadf95df3bea): BOTORCH_MODULAR, failed: 4 ('RESULT: <FLOAT>' not found), best RESULT: 0.5187926007, █▆▁▇, requested 1 jobs, got 1, 1.25 s/job
2026-10-30 14:57:53 (2d0f6459-544d-4362-8636-fadf95df3bea): BOTORCH_MODULAR, failed: 4 ('RESULT: <FLOAT>' not found), best RESULT: 0.5187926007, █▆▁▇, eval #1/1 start
2026-10-30 14:57:53 (2d0f6459-544d-4362-8636-fadf95df3bea): BOTORCH_MODULAR, failed: 4 ('RESULT: <FLOAT>' not found), best RESULT: 0.5187926007, █▆▁▇, starting new job
2026-10-30 14:57:53 (2d0f6459-544d-4362-8636-fadf95df3bea): BOTORCH_MODULAR, failed: 4 ('RESULT: <FLOAT>' not found), best RESULT: 0.5187926007, █▆▁▇, started new job
2026-10-30 14:58:02 (2d0f6459-544d-4362-8636-fadf95df3bea): BOTORCH_MODULAR, failed: 4 ('RESULT: <FLOAT>' not found), best RESULT: 0.5187926007, █▆▁▇, job_failed
2026-10-30 14:58:02 (2d0f6459-544d-4362-8636-fadf95df3bea): BOTORCH_MODULAR, failed: 5 ('RESULT: <FLOAT>' not found), best RESULT: 0.5187926007, █▆▁▇, finishing jobs (get_next_trials), finished 1 job
2026-10-30 14:58:03 (2d0f6459-544d-4362-8636-fadf95df3bea): BOTORCH_MODULAR, failed: 5 ('RESULT: <FLOAT>' not found), best RESULT: 0.5187926007, █▆▁▇, getting new HP set (no sbatch)
2026-10-30 14:58:06 (2d0f6459-544d-4362-8636-fadf95df3bea): BOTORCH_MODULAR, failed: 5 ('RESULT: <FLOAT>' not found), best RESULT: 0.5187926007, █▆▁▇, requested 1 jobs, got 1, 3.86 s/job
2026-10-30 14:58:06 (2d0f6459-544d-4362-8636-fadf95df3bea): BOTORCH_MODULAR, failed: 5 ('RESULT: <FLOAT>' not found), best RESULT: 0.5187926007, █▆▁▇, eval #1/1 start
2026-10-30 14:58:06 (2d0f6459-544d-4362-8636-fadf95df3bea): BOTORCH_MODULAR, failed: 5 ('RESULT: <FLOAT>' not found), best RESULT: 0.5187926007, █▆▁▇, starting new job
2026-10-30 14:58:06 (2d0f6459-544d-4362-8636-fadf95df3bea): BOTORCH_MODULAR, failed: 5 ('RESULT: <FLOAT>' not found), best RESULT: 0.5187926007, █▆▁▇, started new job
2026-10-30 14:58:15 (2d0f6459-544d-4362-8636-fadf95df3bea): BOTORCH_MODULAR, failed: 5 ('RESULT: <FLOAT>' not found), best RESULT: 0.5187926007, █▆▁▇, job_failed
2026-10-30 14:58:15 (2d0f6459-544d-4362-8636-fadf95df3bea): BOTORCH_MODULAR, failed: 6 ('RESULT: <FLOAT>' not found), best RESULT: 0.5187926007, █▆▁▇, finishing jobs, finished 1 job
2026-10-30 14:58:17 (2d0f6459-544d-4362-8636-fadf95df3bea): BOTORCH_MODULAR, failed: 6 ('RESULT: <FLOAT>' not found), best RESULT: 0.5187926007, █▆▁▇, getting new HP set (no sbatch)
2026-10-30 14:58:18 (2d0f6459-544d-4362-8636-fadf95df3bea): BOTORCH_MODULAR, failed: 6 ('RESULT: <FLOAT>' not found), best RESULT: 0.5187926007, █▆▁▇, requested 1 jobs, got 1, 2.56 s/job
2026-10-30 14:58:18 (2d0f6459-544d-4362-8636-fadf95df3bea): BOTORCH_MODULAR, failed: 6 ('RESULT: <FLOAT>' not found), best RESULT: 0.5187926007, █▆▁▇, eval #1/1 start
2026-10-30 14:58:18 (2d0f6459-544d-4362-8636-fadf95df3bea): BOTORCH_MODULAR, failed: 6 ('RESULT: <FLOAT>' not found), best RESULT: 0.5187926007, █▆▁▇, starting new job
2026-10-30 14:58:18 (2d0f6459-544d-4362-8636-fadf95df3bea): BOTORCH_MODULAR, failed: 6 ('RESULT: <FLOAT>' not found), best RESULT: 0.5187926007, █▆▁▇, started new job
2026-10-30 14:58:27 (2d0f6459-544d-4362-8636-fadf95df3bea): BOTORCH_MODULAR, failed: 6 ('RESULT: <FLOAT>' not found), best RESULT: 0.5187926007, █▆▁▇, job_failed
2026-10-30 14:58:27 (2d0f6459-544d-4362-8636-fadf95df3bea): BOTORCH_MODULAR, failed: 7 ('RESULT: <FLOAT>' not found), best RESULT: 0.5187926007, █▆▁▇, finishing jobs (get_next_trials), finished 1 job
2026-10-30 14:58:28 (2d0f6459-544d-4362-8636-fadf95df3bea): BOTORCH_MODULAR, failed: 7 ('RESULT: <FLOAT>' not found), best RESULT: 0.5187926007, █▆▁▇, getting new HP set (no sbatch)
2026-10-30 14:58:28 (2d0f6459-544d-4362-8636-fadf95df3bea): BOTORCH_MODULAR, failed: 7 ('RESULT: <FLOAT>' not found), best RESULT: 0.5187926007, █▆▁▇, requested 1 jobs, got 1, 1.32 s/job
2026-10-30 14:58:28 (2d0f6459-544d-4362-8636-fadf95df3bea): BOTORCH_MODULAR, failed: 7 ('RESULT: <FLOAT>' not found), best RESULT: 0.5187926007, █▆▁▇, eval #1/1 start
2026-10-30 14:58:28 (2d0f6459-544d-4362-8636-fadf95df3bea): BOTORCH_MODULAR, failed: 7 ('RESULT: <FLOAT>' not found), best RESULT: 0.5187926007, █▆▁▇, starting new job
2026-10-30 14:58:28 (2d0f6459-544d-4362-8636-fadf95df3bea): BOTORCH_MODULAR, failed: 7 ('RESULT: <FLOAT>' not found), best RESULT: 0.5187926007, █▆▁▇, started new job
2026-10-30 14:58:37 (2d0f6459-544d-4362-8636-fadf95df3bea): BOTORCH_MODULAR, failed: 7 ('RESULT: <FLOAT>' not found), best RESULT: 0.5187926007, █▆▁▇, job_failed
2026-10-30 14:58:38 (2d0f6459-544d-4362-8636-fadf95df3bea): BOTORCH_MODULAR, failed: 8 ('RESULT: <FLOAT>' not found), best RESULT: 0.5187926007, █▆▁▇, finishing jobs (get_next_trials), finished 1 job
2026-10-30 14:58:39 (2d0f6459-544d-4362-8636-fadf95df3bea): BOTORCH_MODULAR, failed: 8 ('RESULT: <FLOAT>' not found), best RESULT: 0.5187926007, █▆▁▇, getting new HP set (no sbatch)
2026-10-30 14:58:39 (2d0f6459-544d-4362-8636-fadf95df3bea): BOTORCH_MODULAR, failed: 8 ('RESULT: <FLOAT>' not found), best RESULT: 0.5187926007, █▆▁▇, requested 1 jobs, got 1, 1.32 s/job
2026-10-30 14:58:39 (2d0f6459-544d-4362-8636-fadf95df3bea): BOTORCH_MODULAR, failed: 8 ('RESULT: <FLOAT>' not found), best RESULT: 0.5187926007, █▆▁▇, eval #1/1 start
2026-10-30 14:58:39 (2d0f6459-544d-4362-8636-fadf95df3bea): BOTORCH_MODULAR, failed: 8 ('RESULT: <FLOAT>' not found), best RESULT: 0.5187926007, █▆▁▇, starting new job
2026-10-30 14:58:39 (2d0f6459-544d-4362-8636-fadf95df3bea): BOTORCH_MODULAR, failed: 8 ('RESULT: <FLOAT>' not found), best RESULT: 0.5187926007, █▆▁▇, started new job
2026-10-30 14:58:48 (2d0f6459-544d-4362-8636-fadf95df3bea): BOTORCH_MODULAR, failed: 8 ('RESULT: <FLOAT>' not found), best RESULT: 0.5187926007, █▆▁▇, job_failed
2026-10-30 14:58:48 (2d0f6459-544d-4362-8636-fadf95df3bea): BOTORCH_MODULAR, failed: 9 ('RESULT: <FLOAT>' not found), best RESULT: 0.5187926007, █▆▁▇, finishing jobs (get_next_trials), finished 1 job
2026-10-30 14:58:49 (2d0f6459-544d-4362-8636-fadf95df3bea): BOTORCH_MODULAR, failed: 9 ('RESULT: <FLOAT>' not found), best RESULT: 0.5187926007, █▆▁▇, getting new HP set (no sbatch)
2026-10-30 14:58:49 (2d0f6459-544d-4362-8636-fadf95df3bea): BOTORCH_MODULAR, failed: 9 ('RESULT: <FLOAT>' not found), best RESULT: 0.5187926007, █▆▁▇, requested 1 jobs, got 1, 1.25 s/job
2026-10-30 14:58:49 (2d0f6459-544d-4362-8636-fadf95df3bea): BOTORCH_MODULAR, failed: 9 ('RESULT: <FLOAT>' not found), best RESULT: 0.5187926007, █▆▁▇, eval #1/1 start
2026-10-30 14:58:50 (2d0f6459-544d-4362-8636-fadf95df3bea): BOTORCH_MODULAR, failed: 9 ('RESULT: <FLOAT>' not found), best RESULT: 0.5187926007, █▆▁▇, starting new job
2026-10-30 14:58:50 (2d0f6459-544d-4362-8636-fadf95df3bea): BOTORCH_MODULAR, failed: 9 ('RESULT: <FLOAT>' not found), best RESULT: 0.5187926007, █▆▁▇, started new job
2026-10-30 14:58:59 (2d0f6459-544d-4362-8636-fadf95df3bea): BOTORCH_MODULAR, failed: 9 ('RESULT: <FLOAT>' not found), best RESULT: 0.5187926007, █▆▁▇, job_failed
2026-10-30 14:58:59 (2d0f6459-544d-4362-8636-fadf95df3bea): BOTORCH_MODULAR, failed: 10 ('RESULT: <FLOAT>' not found), best RESULT: 0.5187926007, █▆▁▇, finishing jobs (get_next_trials), finished 1 job
2026-10-30 14:59:00 (2d0f6459-544d-4362-8636-fadf95df3bea): BOTORCH_MODULAR, failed: 10 ('RESULT: <FLOAT>' not found), best RESULT: 0.5187926007, █▆▁▇, getting new HP set (no sbatch)
2026-10-30 14:59:01 (2d0f6459-544d-4362-8636-fadf95df3bea): BOTORCH_MODULAR, failed: 10 ('RESULT: <FLOAT>' not found), best RESULT: 0.5187926007, █▆▁▇, requested 1 jobs, got 1, 2.52 s/job
2026-10-30 14:59:01 (2d0f6459-544d-4362-8636-fadf95df3bea): BOTORCH_MODULAR, failed: 10 ('RESULT: <FLOAT>' not found), best RESULT: 0.5187926007, █▆▁▇, eval #1/1 start
2026-10-30 14:59:01 (2d0f6459-544d-4362-8636-fadf95df3bea): BOTORCH_MODULAR, failed: 10 ('RESULT: <FLOAT>' not found), best RESULT: 0.5187926007, █▆▁▇, starting new job
2026-10-30 14:59:01 (2d0f6459-544d-4362-8636-fadf95df3bea): BOTORCH_MODULAR, failed: 10 ('RESULT: <FLOAT>' not found), best RESULT: 0.5187926007, █▆▁▇, started new job
2026-10-30 14:59:10 (2d0f6459-544d-4362-8636-fadf95df3bea): BOTORCH_MODULAR, failed: 10 ('RESULT: <FLOAT>' not found), best RESULT: 0.5187926007, █▆▁▇, job_failed
2026-10-30 14:59:11 (2d0f6459-544d-4362-8636-fadf95df3bea): BOTORCH_MODULAR, failed: 11 ('RESULT: <FLOAT>' not found), best RESULT: 0.5187926007, █▆▁▇, finishing jobs (get_next_trials), finished 1 job
2026-10-30 14:59:12 (2d0f6459-544d-4362-8636-fadf95df3bea): BOTORCH_MODULAR, failed: 11 ('RESULT: <FLOAT>' not found), best RESULT: 0.5187926007, █▆▁▇, getting new HP set (no sbatch)
2026-10-30 14:59:12 (2d0f6459-544d-4362-8636-fadf95df3bea): BOTORCH_MODULAR, failed: 11 ('RESULT: <FLOAT>' not found), best RESULT: 0.5187926007, █▆▁▇, requested 1 jobs, got 1, 1.48 s/job
2026-10-30 14:59:12 (2d0f6459-544d-4362-8636-fadf95df3bea): BOTORCH_MODULAR, failed: 11 ('RESULT: <FLOAT>' not found), best RESULT: 0.5187926007, █▆▁▇, eval #1/1 start
2026-10-30 14:59:12 (2d0f6459-544d-4362-8636-fadf95df3bea): BOTORCH_MODULAR, failed: 11 ('RESULT: <FLOAT>' not found), best RESULT: 0.5187926007, █▆▁▇, starting new job
2026-10-30 14:59:12 (2d0f6459-544d-4362-8636-fadf95df3bea): BOTORCH_MODULAR, failed: 11 ('RESULT: <FLOAT>' not found), best RESULT: 0.5187926007, █▆▁▇, started new job
2026-10-30 14:59:22 (2d0f6459-544d-4362-8636-fadf95df3bea): BOTORCH_MODULAR, failed: 11 ('RESULT: <FLOAT>' not found), best RESULT: 0.5187926007, █▆▁▇, job_failed
2026-10-30 14:59:22 (2d0f6459-544d-4362-8636-fadf95df3bea): BOTORCH_MODULAR, failed: 12 ('RESULT: <FLOAT>' not found), best RESULT: 0.5187926007, █▆▁▇, finishing jobs (get_next_trials), finished 1 job
2026-10-30 14:59:24 (2d0f6459-544d-4362-8636-fadf95df3bea): BOTORCH_MODULAR, failed: 12 ('RESULT: <FLOAT>' not found), best RESULT: 0.5187926007, █▆▁▇, getting new HP set (no sbatch)
2026-10-30 14:59:24 (2d0f6459-544d-4362-8636-fadf95df3bea): BOTORCH_MODULAR, failed: 12 ('RESULT: <FLOAT>' not found), best RESULT: 0.5187926007, █▆▁▇, requested 1 jobs, got 1, 1.34 s/job
2026-10-30 14:59:24 (2d0f6459-544d-4362-8636-fadf95df3bea): BOTORCH_MODULAR, failed: 12 ('RESULT: <FLOAT>' not found), best RESULT: 0.5187926007, █▆▁▇, eval #1/1 start
2026-10-30 14:59:24 (2d0f6459-544d-4362-8636-fadf95df3bea): BOTORCH_MODULAR, failed: 12 ('RESULT: <FLOAT>' not found), best RESULT: 0.5187926007, █▆▁▇, starting new job
2026-10-30 14:59:24 (2d0f6459-544d-4362-8636-fadf95df3bea): BOTORCH_MODULAR, failed: 12 ('RESULT: <FLOAT>' not found), best RESULT: 0.5187926007, █▆▁▇, started new job
2026-10-30 14:59:33 (2d0f6459-544d-4362-8636-fadf95df3bea): BOTORCH_MODULAR, failed: 12 ('RESULT: <FLOAT>' not found), best RESULT: 0.5187926007, █▆▁▇, job_failed
2026-10-30 14:59:33 (2d0f6459-544d-4362-8636-fadf95df3bea): BOTORCH_MODULAR, failed: 13 ('RESULT: <FLOAT>' not found), best RESULT: 0.5187926007, █▆▁▇, finishing jobs (get_next_trials), finished 1 job
2026-10-30 14:59:34 (2d0f6459-544d-4362-8636-fadf95df3bea): BOTORCH_MODULAR, failed: 13 ('RESULT: <FLOAT>' not found), best RESULT: 0.5187926007, █▆▁▇, getting new HP set (no sbatch)
2026-10-30 14:59:36 (2d0f6459-544d-4362-8636-fadf95df3bea): BOTORCH_MODULAR, failed: 13 ('RESULT: <FLOAT>' not found), best RESULT: 0.5187926007, █▆▁▇, requested 1 jobs, got 1, 2.69 s/job
2026-10-30 14:59:36 (2d0f6459-544d-4362-8636-fadf95df3bea): BOTORCH_MODULAR, failed: 13 ('RESULT: <FLOAT>' not found), best RESULT: 0.5187926007, █▆▁▇, eval #1/1 start
2026-10-30 14:59:36 (2d0f6459-544d-4362-8636-fadf95df3bea): BOTORCH_MODULAR, failed: 13 ('RESULT: <FLOAT>' not found), best RESULT: 0.5187926007, █▆▁▇, starting new job
2026-10-30 14:59:36 (2d0f6459-544d-4362-8636-fadf95df3bea): BOTORCH_MODULAR, failed: 13 ('RESULT: <FLOAT>' not found), best RESULT: 0.5187926007, █▆▁▇, started new job
2026-10-30 14:59:46 (2d0f6459-544d-4362-8636-fadf95df3bea): BOTORCH_MODULAR, failed: 13 ('RESULT: <FLOAT>' not found), best RESULT: 0.5187926007, █▆▁▇, job_failed
2026-10-30 14:59:46 (2d0f6459-544d-4362-8636-fadf95df3bea): BOTORCH_MODULAR, failed: 14 ('RESULT: <FLOAT>' not found), best RESULT: 0.5187926007, █▆▁▇, finishing jobs (get_next_trials), finished 1 job
2026-10-30 14:59:48 (2d0f6459-544d-4362-8636-fadf95df3bea): BOTORCH_MODULAR, failed: 14 ('RESULT: <FLOAT>' not found), best RESULT: 0.5187926007, █▆▁▇, getting new HP set (no sbatch)
2026-10-30 14:59:48 (2d0f6459-544d-4362-8636-fadf95df3bea): BOTORCH_MODULAR, failed: 14 ('RESULT: <FLOAT>' not found), best RESULT: 0.5187926007, █▆▁▇, requested 1 jobs, got 1, 1.53 s/job
2026-10-30 14:59:48 (2d0f6459-544d-4362-8636-fadf95df3bea): BOTORCH_MODULAR, failed: 14 ('RESULT: <FLOAT>' not found), best RESULT: 0.5187926007, █▆▁▇, eval #1/1 start
2026-10-30 14:59:48 (2d0f6459-544d-4362-8636-fadf95df3bea): BOTORCH_MODULAR, failed: 14 ('RESULT: <FLOAT>' not found), best RESULT: 0.5187926007, █▆▁▇, starting new job
2026-10-30 14:59:48 (2d0f6459-544d-4362-8636-fadf95df3bea): BOTORCH_MODULAR, failed: 14 ('RESULT: <FLOAT>' not found), best RESULT: 0.5187926007, █▆▁▇, started new job
2026-10-30 14:59:58 (2d0f6459-544d-4362-8636-fadf95df3bea): BOTORCH_MODULAR, failed: 14 ('RESULT: <FLOAT>' not found), best RESULT: 0.5187926007, █▆▁▇, job_failed
2026-10-30 14:59:58 (2d0f6459-544d-4362-8636-fadf95df3bea): BOTORCH_MODULAR, failed: 15 ('RESULT: <FLOAT>' not found), best RESULT: 0.5187926007, █▆▁▇, finishing jobs (get_next_trials), finished 1 job
2026-10-30 15:00:00 (2d0f6459-544d-4362-8636-fadf95df3bea): BOTORCH_MODULAR, failed: 15 ('RESULT: <FLOAT>' not found), best RESULT: 0.5187926007, █▆▁▇, getting new HP set (no sbatch)
2026-10-30 15:00:00 (2d0f6459-544d-4362-8636-fadf95df3bea): BOTORCH_MODULAR, failed: 15 ('RESULT: <FLOAT>' not found), best RESULT: 0.5187926007, █▆▁▇, requested 1 jobs, got 1, 1.50 s/job
2026-10-30 15:00:00 (2d0f6459-544d-4362-8636-fadf95df3bea): BOTORCH_MODULAR, failed: 15 ('RESULT: <FLOAT>' not found), best RESULT: 0.5187926007, █▆▁▇, eval #1/1 start
2026-10-30 15:00:00 (2d0f6459-544d-4362-8636-fadf95df3bea): BOTORCH_MODULAR, failed: 15 ('RESULT: <FLOAT>' not found), best RESULT: 0.5187926007, █▆▁▇, starting new job
2026-10-30 15:00:00 (2d0f6459-544d-4362-8636-fadf95df3bea): BOTORCH_MODULAR, failed: 15 ('RESULT: <FLOAT>' not found), best RESULT: 0.5187926007, █▆▁▇, started new job
2026-10-30 15:00:04 (2d0f6459-544d-4362-8636-fadf95df3bea): BOTORCH_MODULAR, failed: 15 ('RESULT: <FLOAT>' not found), best RESULT: 0.5187926007, █▆▁▇, job_failed
2026-10-30 15:00:04 (2d0f6459-544d-4362-8636-fadf95df3bea): BOTORCH_MODULAR, failed: 16 ('RESULT: <FLOAT>' not found), best RESULT: 0.5187926007, █▆▁▇, finishing jobs, finished 1 job
2026-10-30 15:00:06 (2d0f6459-544d-4362-8636-fadf95df3bea): BOTORCH_MODULAR, failed: 16 ('RESULT: <FLOAT>' not found), best RESULT: 0.5187926007, █▆▁▇, getting new HP set (no sbatch)
2026-10-30 15:00:09 (2d0f6459-544d-4362-8636-fadf95df3bea): BOTORCH_MODULAR, failed: 16 ('RESULT: <FLOAT>' not found), best RESULT: 0.5187926007, █▆▁▇, requested 1 jobs, got 1, 4.93 s/job
2026-10-30 15:00:09 (2d0f6459-544d-4362-8636-fadf95df3bea): BOTORCH_MODULAR, failed: 16 ('RESULT: <FLOAT>' not found), best RESULT: 0.5187926007, █▆▁▇, eval #1/1 start
2026-10-30 15:00:09 (2d0f6459-544d-4362-8636-fadf95df3bea): BOTORCH_MODULAR, failed: 16 ('RESULT: <FLOAT>' not found), best RESULT: 0.5187926007, █▆▁▇, starting new job
2026-10-30 15:00:09 (2d0f6459-544d-4362-8636-fadf95df3bea): BOTORCH_MODULAR, failed: 16 ('RESULT: <FLOAT>' not found), best RESULT: 0.5187926007, █▆▁▇, started new job
2026-10-30 15:00:19 (2d0f6459-544d-4362-8636-fadf95df3bea): BOTORCH_MODULAR, failed: 16 ('RESULT: <FLOAT>' not found), best RESULT: 0.5187926007, █▆▁▇, job_failed
2026-10-30 15:00:19 (2d0f6459-544d-4362-8636-fadf95df3bea): BOTORCH_MODULAR, failed: 17 ('RESULT: <FLOAT>' not found), best RESULT: 0.5187926007, █▆▁▇, finishing jobs (get_next_trials), finished 1 job
2026-10-30 15:00:21 (2d0f6459-544d-4362-8636-fadf95df3bea): BOTORCH_MODULAR, failed: 17 ('RESULT: <FLOAT>' not found), best RESULT: 0.5187926007, █▆▁▇, getting new HP set (no sbatch)
2026-10-30 15:00:21 (2d0f6459-544d-4362-8636-fadf95df3bea): BOTORCH_MODULAR, failed: 17 ('RESULT: <FLOAT>' not found), best RESULT: 0.5187926007, █▆▁▇, requested 1 jobs, got 1, 1.65 s/job
2026-10-30 15:00:21 (2d0f6459-544d-4362-8636-fadf95df3bea): BOTORCH_MODULAR, failed: 17 ('RESULT: <FLOAT>' not found), best RESULT: 0.5187926007, █▆▁▇, eval #1/1 start
2026-10-30 15:00:21 (2d0f6459-544d-4362-8636-fadf95df3bea): BOTORCH_MODULAR, failed: 17 ('RESULT: <FLOAT>' not found), best RESULT: 0.5187926007, █▆▁▇, starting new job
2026-10-30 15:00:21 (2d0f6459-544d-4362-8636-fadf95df3bea): BOTORCH_MODULAR, failed: 17 ('RESULT: <FLOAT>' not found), best RESULT: 0.5187926007, █▆▁▇, started new job
2026-10-30 15:00:31 (2d0f6459-544d-4362-8636-fadf95df3bea): BOTORCH_MODULAR, failed: 17 ('RESULT: <FLOAT>' not found), best RESULT: 0.5187926007, █▆▁▇, new result: RESULT: 311113719.000000
2026-10-30 15:00:32 (2d0f6459-544d-4362-8636-fadf95df3bea): BOTORCH_MODULAR, failed: 17 ('RESULT: <FLOAT>' not found), best RESULT: 0.5187926007, █▆▁▇▆, finishing jobs (get_next_trials), finished 1 job
2026-10-30 15:00:34 (2d0f6459-544d-4362-8636-fadf95df3bea): BOTORCH_MODULAR, failed: 17 ('RESULT: <FLOAT>' not found), best RESULT: 0.5187926007, █▆▁▇▆, getting new HP set (no sbatch)
2026-10-30 15:00:39 (2d0f6459-544d-4362-8636-fadf95df3bea): BOTORCH_MODULAR, failed: 17 ('RESULT: <FLOAT>' not found), best RESULT: 0.5187926007, █▆▁▇▆, requested 1 jobs, got 1, 6.90 s/job
2026-10-30 15:00:39 (2d0f6459-544d-4362-8636-fadf95df3bea): BOTORCH_MODULAR, failed: 17 ('RESULT: <FLOAT>' not found), best RESULT: 0.5187926007, █▆▁▇▆, eval #1/1 start
2026-10-30 15:00:39 (2d0f6459-544d-4362-8636-fadf95df3bea): BOTORCH_MODULAR, failed: 17 ('RESULT: <FLOAT>' not found), best RESULT: 0.5187926007, █▆▁▇▆, starting new job
2026-10-30 15:00:39 (2d0f6459-544d-4362-8636-fadf95df3bea): BOTORCH_MODULAR, failed: 17 ('RESULT: <FLOAT>' not found), best RESULT: 0.5187926007, █▆▁▇▆, started new job
2026-10-30 15:00:49 (2d0f6459-544d-4362-8636-fadf95df3bea): BOTORCH_MODULAR, failed: 17 ('RESULT: <FLOAT>' not found), best RESULT: 0.5187926007, █▆▁▇▆, job_failed
2026-10-30 15:00:50 (2d0f6459-544d-4362-8636-fadf95df3bea): BOTORCH_MODULAR, failed: 18 ('RESULT: <FLOAT>' not found), best RESULT: 0.5187926007, █▆▁▇▆, finishing jobs (get_next_trials), finished 1 job
2026-10-30 15:00:50 (2d0f6459-544d-4362-8636-fadf95df3bea): BOTORCH_MODULAR, failed: 18 ('RESULT: <FLOAT>' not found), best RESULT: 0.5187926007, █▆▁▇▆, getting new HP set (no sbatch)
2026-10-30 15:01:53 (2d0f6459-544d-4362-8636-fadf95df3bea): BOTORCH_MODULAR, failed: 18 ('RESULT: <FLOAT>' not found), best RESULT: 0.5187926007, █▆▁▇▆, requested 1 jobs, got 0, n/a
2026-10-30 15:01:54 (2d0f6459-544d-4362-8636-fadf95df3bea): BOTORCH_MODULAR, failed: 18 ('RESULT: <FLOAT>' not found), best RESULT: 0.5187926007, █▆▁▇▆, getting new HP set (no sbatch)
2026-10-30 15:02:10 (2d0f6459-544d-4362-8636-fadf95df3bea): BOTORCH_MODULAR, failed: 18 ('RESULT: <FLOAT>' not found), best RESULT: 0.5187926007, █▆▁▇▆, requested 1 jobs, got 0, n/a
2026-10-30 15:02:12 (2d0f6459-544d-4362-8636-fadf95df3bea): BOTORCH_MODULAR, failed: 18 ('RESULT: <FLOAT>' not found), best RESULT: 0.5187926007, █▆▁▇▆, getting new HP set (no sbatch)
2026-10-30 15:02:33 (2d0f6459-544d-4362-8636-fadf95df3bea): BOTORCH_MODULAR, failed: 18 ('RESULT: <FLOAT>' not found), best RESULT: 0.5187926007, █▆▁▇▆, requested 1 jobs, got 0, n/a
2026-10-30 15:02:34 (2d0f6459-544d-4362-8636-fadf95df3bea): BOTORCH_MODULAR, failed: 18 ('RESULT: <FLOAT>' not found), best RESULT: 0.5187926007, █▆▁▇▆, getting new HP set (no sbatch)
2026-10-30 15:02:51 (2d0f6459-544d-4362-8636-fadf95df3bea): BOTORCH_MODULAR, failed: 18 ('RESULT: <FLOAT>' not found), best RESULT: 0.5187926007, █▆▁▇▆, requested 1 jobs, got 0, n/a
2026-10-30 15:02:53 (2d0f6459-544d-4362-8636-fadf95df3bea): BOTORCH_MODULAR, failed: 18 ('RESULT: <FLOAT>' not found), best RESULT: 0.5187926007, █▆▁▇▆, getting new HP set (no sbatch)
2026-10-30 15:03:11 (2d0f6459-544d-4362-8636-fadf95df3bea): BOTORCH_MODULAR, failed: 18 ('RESULT: <FLOAT>' not found), best RESULT: 0.5187926007, █▆▁▇▆, requested 1 jobs, got 0, n/a
2026-10-30 15:03:13 (2d0f6459-544d-4362-8636-fadf95df3bea): BOTORCH_MODULAR, failed: 18 ('RESULT: <FLOAT>' not found), best RESULT: 0.5187926007, █▆▁▇▆, getting new HP set (no sbatch)
2026-10-30 15:06:18 (2d0f6459-544d-4362-8636-fadf95df3bea): BOTORCH_MODULAR, failed: 18 ('RESULT: <FLOAT>' not found), best RESULT: 0.5187926007, █▆▁▇▆, requested 1 jobs, got 0, n/a
2026-10-30 15:06:20 (2d0f6459-544d-4362-8636-fadf95df3bea): BOTORCH_MODULAR, failed: 18 ('RESULT: <FLOAT>' not found), best RESULT: 0.5187926007, █▆▁▇▆, getting new HP set (no sbatch)
2026-10-30 15:06:35 (2d0f6459-544d-4362-8636-fadf95df3bea): BOTORCH_MODULAR, failed: 18 ('RESULT: <FLOAT>' not found), best RESULT: 0.5187926007, █▆▁▇▆, requested 1 jobs, got 0, n/a
2026-10-30 15:06:35 (2d0f6459-544d-4362-8636-fadf95df3bea): BOTORCH_MODULAR, failed: 18 ('RESULT: <FLOAT>' not found), best RESULT: 0.5187926007, █▆▁▇▆, found 1 zero-jobs (max: 3)
! No notable correlations between parameters were found (threshold: |r| > 0.3).
Top-5 Best Results
Parameter Sensitivity Ranking
Parameters ranked by absolute Pearson correlation with each result. Stronger correlations (|r| ≥ 0.7) suggest the parameter has more influence on the outcome.
Convergence Analysis
Parameter statistics
Parameter
Min
Max
Mean
Std Dev
Count
run_time
0
12
6
1.7693
23
RESULT
0.5188
1955307364
560534427.1038
726166410.8628
5
program
No numerical statistics available
Show SLURM-Job-ID (if it exists)
Some single-run logs were not shared
By default only logs from failed or interrupted jobs are shared. Successful logs and logs above the upload cap were left out.
single_runs/16678 — successful job (logs are skipped by default)
single_runs/16716 — successful job (logs are skipped by default)
To see these logs here as well, run one of these commands on the machine that has the run folder: